program: Gaussian 09
title: 000146785
version: EM64L-G09RevD.01
frameworkgroup: C1[X(C9H14N5O7P)]
method: RPBEPBE
basis: SDD
operation: Freq
keyword: #p
keyword: freq=noraman
keyword: PBEPBE/SDD
title: #p freq=noraman PBEPBE/SDD
converged: YES YES NO NO
title: Mulliken charges:
elementType: P O O O O O O O N N N N N C C C C C C C C C H H H H H H H H H H H H H H
charge: 1.434193 -0.302053 -0.571390 -0.426887 -0.222783 -0.674298 -0.658131 -0.618846 -0.186219 -0.453200 -0.028982 -0.062903 -0.652614 -0.016450 -0.261961 0.359077 -0.271056 -0.340848 -0.131547 -0.248597 0.010772 0.136600 0.226272 0.227352 0.223701 0.256873 0.250829 0.219959 0.207244 0.266144 0.390935 0.360541 0.386003 0.339297 0.420689 0.412283
chargesum: 0.00000
title: Mulliken charges with hydrogens summed into heavy atoms:
elementType: P O O O O O O O N N N N N C C C C C C C C C
charge: 1.434193 -0.302053 -0.571390 -0.066346 -0.222783 -0.253608 -0.245848 -0.618846 -0.186219 -0.062265 -0.028982 -0.062903 0.072687 0.209822 0.189092 0.359077 0.236646 0.086355 -0.131547 0.017547 0.010772 0.136600
polarizability: 2.36936648e+02 1.14138911e+00 1.93008061e+02 1.28596774e+00 -2.45931036e+01 1.22382496e+02
1716.lowfreq: -7.7615 -0.0016 -0.0010 -0.0004 3.8991 6.2223 16.0781 30.1611 42.5244
frequency: 15.9317 30.1050 42.4763 53.9361 63.2720 78.7109 95.7108 105.7694 114.2983 130.1415 138.4810 174.2346 188.4471 195.0200 196.0727 230.5883 247.0971 253.8886 292.5402 302.0313 327.8547 329.3807 348.2353 357.0186 373.3916 387.9818 391.6761 408.7207 456.4223 463.5709 491.6846 501.9790 536.4516 584.8809 601.8657 619.4166 630.8397 649.9604 652.7207 674.9927 695.4064 708.2159 731.2728 732.5091 747.6723 761.3834 779.7556 813.4389 838.0282 880.9855 904.9166 930.1457 970.3775 994.9198 995.5250 1005.7796 1009.1021 1010.7976 1015.0110 1052.1958 1069.5720 1083.2244 1111.1388 1145.2507 1180.6073 1187.3230 1200.7466 1217.6749 1258.3174 1278.6165 1286.5602 1307.3385 1331.9362 1340.2659 1349.5138 1355.2458 1382.5297 1391.6071 1392.6060 1429.3920 1463.6440 1471.6731 1482.3321 1532.4210 1545.5047 1621.7939 1624.3754 1654.0296 2953.4233 2959.0400 2985.5568 3010.9024 3027.4104 3080.4597 3083.7911 3228.1786 3411.2464 3438.1824 3548.6028 3586.4127 3611.7953 3650.2168
redmass: 6.2828 7.4995 6.7885 8.5607 6.6335 5.5242 7.4833 6.4124 5.1954 5.7544 4.3283 3.8442 5.9354 2.7988 2.6853 4.7031 3.3214 3.3282 3.6847 2.6783 7.5935 6.7337 5.2840 4.0612 3.6732 1.5673 3.4658 6.0057 1.2844 6.8596 4.0009 4.6559 1.1078 6.2573 6.4125 2.7153 1.4126 7.2382 5.0766 5.8346 5.2759 1.4393 4.6055 1.6878 5.2855 4.6204 6.6463 4.5434 5.3341 2.4019 2.8714 6.5502 6.6723 2.4554 2.5429 1.6937 2.1468 1.9540 1.4758 3.8407 2.9617 6.3429 1.8407 1.7367 2.7618 1.2196 1.7801 1.2120 2.4030 1.4786 1.9647 1.3344 1.3229 1.9353 4.7019 1.2666 1.3217 2.9855 1.6657 3.8459 1.0848 1.1094 1.1035 5.0566 3.7108 4.2463 3.4196 1.7669 1.0757 1.0655 1.0650 1.0593 1.1041 1.1020 1.1040 1.0982 1.0610 1.0784 1.0654 1.0665 1.0669 1.0939
irintensity: 0.4817 2.4078 2.0877 4.0822 3.5251 1.1242 0.4666 4.4526 0.9019 10.6786 1.3251 12.2035 5.8690 16.7956 57.5291 4.4449 38.3750 2.1372 9.1991 26.2522 2.0875 63.5283 25.4072 49.1228 24.4141 77.9804 22.1568 23.2817 143.0508 4.5827 3.5180 1.5793 97.3176 6.3305 3.0525 6.3536 71.5760 3.8962 1.5117 54.1729 74.9952 52.2349 84.9119 47.2367 322.2286 205.4999 4.5492 3.9393 16.8893 39.6651 129.1645 11.0455 182.0654 75.1049 9.8397 81.5256 15.2028 30.3287 99.6856 51.2611 116.1201 198.2716 7.4440 24.0770 21.9359 12.0133 23.5604 12.3369 5.7992 3.5969 1.4617 43.4920 55.3661 68.6059 71.3314 6.2345 22.9000 79.4449 61.4400 12.4523 4.2359 22.9920 10.7976 295.5476 114.0378 333.1734 263.2259 312.8507 10.3997 62.6444 46.0710 23.2479 26.6824 16.4251 27.7972 0.0548 210.6167 460.1480 14.3012 104.2290 117.4916 124.3231
temp: 298.150 k
press: 1.00000 atm
elementType: 15 8 8 8 8 8 8 8 7 7 7 7 7 6 6 6 6 6 6 6 6 6 1 1 1 1 1 1 1 1 1 1 1 1 1 1
symmnumber: 1
zpe: 679393.3 jmol-1
zpe.correction: 0.258767 hartree
zpe.thermalcorrener: 0.281351 hartree
zpe.thermalcorrenthalpy: 0.282295 hartree
zpe.thermalcorrgfe: 0.205540 hartree
zpe.sumelectzpe: -1491.203306 hartree
zpe.sumelectthermal: -1491.180722 hartree
zpe.sumelectthermalent: -1491.179778 hartree
zpe.sumelectthermalfe: -1491.256533 hartree
dipole: -17.5268 2.4555 -4.0078
dipole: 18.1461
quadrupole: -178.2155 -135.7984 -129.6111
quadrupole: 27.5705 -1.1191 -9.1631
quadrupole: -30.3405 12.0766 18.2639 27.5705 -1.1191 -9.1631
hfenergy: -1491.4620729 hartree
pointgroup: C01 [X(C9H14N5O7P1)]
dipole: 6.8591492 0.4138019 -1.9362906 debye
polarizability: 233.8794249|10.7971521|194.7595862|-11.8403291|23.884322|123.6881943 unknown
InChI: InChI=1S/C9H14N5O7P/c10-9-12-7-6(8(16)13-9)11-3-14(7)4-20-5(1-15)2-21-22(17,18)19/h3,5,12,15,17-18H,1-2,4,10H2
charge 0 multiplicity 1
36 atoms
P  2.864329 2.270913 -0.425584
O  1.001709 -1.807002 -0.004546
O  2.270812 0.683785 -0.238229
O  2.646571 -3.19349 1.781542
O  -5.008452 0.584894 0.72703
O  3.196084 2.25716 -2.095159
O  4.470334 2.310764 0.186832
O  1.857143 3.316775 0.199309
N  -1.180615 -1.620911 -0.832264
N  -0.879245 0.685444 0.088375
N  -3.442301 -1.806591 -0.537064
N  -2.954364 1.728621 0.803775
N  -0.924638 2.883544 0.976356
C  2.460549 -1.75369 -0.210709
C  0.172981 -1.938072 -1.216787
C  -1.622269 -0.426478 -0.265489
C  2.923207 -0.473819 -0.924719
C  3.033787 -1.910464 1.209695
C  -3.00967 -0.537095 -0.090577
C  -2.344628 -2.432846 -0.961797
C  -3.767451 0.587085 0.501656
C  -1.638723 1.760079 0.624024
H  2.789863 -2.620092 -0.827261
H  0.203641 -2.972001 -1.610902
H  0.535115 -1.232281 -1.992906
H  2.632389 -0.438307 -1.988328
H  4.023463 -0.380616 -0.851203
H  2.691118 -1.060465 1.834594
H  4.136321 -1.920255 1.175051
H  -2.294904 -3.439126 -1.372793
H  0.147651 0.655718 0.123343
H  1.654818 -3.227786 1.792467
H  0.055025 3.048112 0.717422
H  -1.479623 3.637574 1.374953
H  3.673731 3.038639 -2.470648
H  4.561443 2.647783 1.11534
