program: Gaussian 09
title: 000146743
version: EM64L-G09RevD.01
frameworkgroup: C1[X(C11H14N4O8)]
method: RPBEPBE
basis: SDD
operation: Freq
keyword: #p
keyword: freq=noraman
keyword: PBEPBE/SDD
title: #p freq=noraman PBEPBE/SDD
converged: YES YES NO NO
title: Mulliken charges:
elementType: O O O O O O O O N N N N C C C C C C C C C C C H H H H H H H H H H H H H H
charge: -0.478170 -0.512405 -0.453492 -0.491878 -0.193045 -0.256240 -0.214103 -0.205236 -0.041718 -0.437072 0.021986 0.015533 -0.156421 -0.071733 0.158292 -0.402573 -0.401984 0.295420 0.257289 -0.283797 -0.501089 0.447832 -0.374668 0.214654 0.220739 0.232949 0.245590 0.246666 0.266592 0.389699 0.448795 0.381163 0.271820 0.336356 0.289476 0.353523 0.381250
chargesum: 0.00000
title: Mulliken charges with hydrogens summed into heavy atoms:
elementType: O O O O O O O O N N N N C C C C C C C C C C C
charge: -0.088471 -0.131242 -0.099969 -0.110628 -0.193045 -0.256240 -0.214103 -0.205236 -0.041718 0.011722 0.021986 0.015533 0.058233 0.149006 0.158292 0.075967 0.111275 0.295420 0.257289 -0.011977 -0.164733 0.447832 -0.085192
polarizability: 3.42035491e+02 -3.34985575e+01 2.37100570e+02 3.50427530e+00 4.57888185e+00 9.08507292e+01
1716.lowfreq: -4.4166 -0.0004 0.0002 0.0007 3.4488 4.8920 18.4338 32.5516 41.3958
frequency: 18.1607 32.5220 41.3645 46.9854 60.5491 65.5416 76.0474 86.3595 96.0012 116.8834 129.9905 156.9448 161.0067 177.6705 194.8393 235.5823 260.2266 288.8085 301.9799 309.2590 320.0461 322.5698 339.1726 356.5661 376.8562 390.8049 409.0438 438.6531 454.6870 479.0844 506.6071 518.6540 523.3279 534.1085 555.1480 577.1380 611.8755 645.4400 653.9428 669.1717 707.1891 730.3250 733.1079 755.0547 811.7006 851.3217 854.0295 856.8166 885.6208 923.3980 950.6457 958.9455 966.4781 973.0872 991.3455 1003.5546 1015.6416 1042.2296 1055.4002 1067.8490 1087.2167 1111.1919 1135.0715 1138.6079 1160.2410 1176.0238 1184.4884 1213.0134 1217.0870 1231.3004 1236.2734 1248.3116 1286.2301 1290.6964 1303.0625 1320.1946 1339.9461 1355.5520 1358.8509 1380.1452 1383.1548 1389.0757 1415.8016 1446.6332 1450.9139 1459.9348 1461.0304 1514.2922 1571.8438 1605.1437 1625.0098 2901.8169 2963.7817 2983.1878 3026.7167 3047.8474 3101.2524 3154.6836 3178.6553 3187.9846 3202.2174 3476.0071 3484.8005 3574.3404 3611.9284
redmass: 7.1573 6.7791 6.9055 6.8833 12.2704 4.8863 8.0304 3.6326 3.6250 5.8790 4.5757 9.9327 5.7082 6.3448 7.8645 6.1474 5.8820 2.3461 1.3698 5.0660 4.0633 3.3212 3.4378 6.9875 3.5136 4.2316 5.8120 4.1414 3.5795 6.4969 7.1512 3.6864 1.9067 1.7621 1.2397 2.3544 5.8904 6.3579 7.5737 10.1599 7.4941 5.4974 5.3516 12.4592 4.6454 1.5300 2.4873 3.0314 6.3555 6.0494 1.9122 1.8897 1.4142 2.8755 4.2750 1.3235 1.8352 2.8804 2.3034 3.5494 2.9988 4.8770 1.3459 1.3355 1.2979 2.6838 2.5547 1.2008 5.0729 1.2437 1.7851 1.1928 1.1713 1.7510 1.2160 1.2764 4.6529 2.7264 1.6186 2.7498 1.6584 1.6930 2.4012 3.4842 1.2696 1.1941 1.8446 3.9771 6.8955 8.8235 7.5152 1.0806 1.0635 1.0854 1.0579 1.0976 1.1083 1.0824 1.0896 1.0918 1.0951 1.0646 1.0650 1.0666 1.0671
irintensity: 0.1969 2.6558 2.8208 2.3159 0.9827 6.1127 1.7286 9.0480 1.9267 6.4495 6.7051 1.8036 2.8379 5.1077 15.3552 14.2101 4.9852 31.6400 100.6976 22.5020 12.2735 9.6178 43.1458 4.9281 16.7650 9.9873 27.7822 11.5980 15.5924 20.0827 6.1880 7.5710 149.3570 66.6045 106.4387 48.0371 0.1630 3.6631 17.4943 13.9188 7.1033 8.5197 31.6820 9.3925 8.7403 59.4179 9.6565 43.2498 2.9973 85.7138 46.0352 63.2174 25.8215 37.4895 66.6651 0.4667 67.0200 39.0611 134.8860 21.0905 27.7839 27.9589 28.7200 42.1433 50.1150 107.1583 521.9672 65.7973 358.5634 11.5335 90.8654 42.4226 50.8487 51.9147 16.4721 17.4486 200.7395 34.3612 52.7507 23.2840 16.3152 40.8249 4.4914 1.0313 10.0016 10.3816 6.8827 208.4927 129.6763 7.6976 409.8671 35.2474 23.1452 44.7973 26.3061 28.1060 20.9293 304.3219 1.8290 20.7483 1.1753 97.8870 33.7795 9.4598 27.3243
temp: 298.150 k
press: 1.00000 atm
elementType: 8 8 8 8 8 8 8 8 7 7 7 7 6 6 6 6 6 6 6 6 6 6 6 1 1 1 1 1 1 1 1 1 1 1 1 1 1
symmnumber: 1
zpe: 697811.2 jmol-1
zpe.correction: 0.265782 hartree
zpe.thermalcorrener: 0.288525 hartree
zpe.thermalcorrenthalpy: 0.289469 hartree
zpe.thermalcorrgfe: 0.211524 hartree
zpe.sumelectzpe: -1246.409894 hartree
zpe.sumelectthermal: -1246.387152 hartree
zpe.sumelectthermalent: -1246.386207 hartree
zpe.sumelectthermalfe: -1246.464153 hartree
dipole: -7.4152 0.2073 -0.3218
dipole: 7.4251
quadrupole: -174.9796 -134.4118 -134.8623
quadrupole: 0.5959 -0.8681 0.5862
quadrupole: -26.8950 13.6728 13.2222 0.5959 -0.8681 0.5862
hfenergy: -1246.6756767 hartree
pointgroup: C01 [X(C11H14N4O8)]
dipole: -2.8939784 0.1087223 -0.3831995 debye
polarizability: 338.4702533|-34.0908345|237.9693466|26.7556107|-5.9547007|93.5471904 unknown
InChI: InChI=1S/C11H14N4O8/c16-4-8(11(19)10(18)5-17)13-12-7-2-1-6(14(20)21)3-9(7)15(22)23/h1-3,10-12,16-19H,4-5H2
charge 0 multiplicity 1
37 atoms
O  -4.675633 0.834164 -1.385043
O  -5.167574 -1.65434 -0.794702
O  -3.812865 -3.409472 0.784632
O  -1.752646 3.259274 0.378022
O  3.49947 2.941094 0.439166
O  1.243071 3.186365 0.252509
O  4.384775 -3.25708 0.389971
O  5.62197 -1.34147 0.550592
N  -1.522532 0.372887 0.021357
N  -0.31303 1.065364 0.097244
N  2.315096 2.443211 0.335491
N  4.497424 -1.967537 0.434251
C  -3.933012 0.293997 -0.235036
C  -3.818314 -1.241103 -0.367365
C  -2.624117 1.061131 -0.188649
C  -3.474781 -1.974656 0.942397
C  -2.75255 2.555044 -0.442737
C  0.860412 0.350961 0.180436
C  2.153873 0.985745 0.30262
C  0.84208 -1.084542 0.134636
C  3.339186 0.22424 0.386292
C  3.26135 -1.172342 0.346482
C  2.009931 -1.835939 0.217865
H  -4.506879 0.511248 0.697936
H  -3.084192 -1.498456 -1.15893
H  -4.128893 -1.630811 1.761332
H  -2.417497 -1.822705 1.220266
H  -2.594073 2.73982 -1.527072
H  -3.778909 2.881161 -0.197124
H  -5.409892 0.181595 -1.556967
H  -0.316005 2.106803 0.187058
H  -5.275694 -2.606233 -0.522439
H  -0.130364 -1.566776 0.027233
H  4.303277 0.730711 0.479288
H  1.991837 -2.928425 0.184974
H  -3.0703 -3.881538 0.330592
H  -1.677001 4.20711 0.111321
