program: Gaussian 09
title: 000146697
version: EM64L-G09RevD.01
frameworkgroup: C1[X(C8H8ClN3O2)]
method: RPBEPBE
basis: SDD
operation: Freq
keyword: #p
keyword: freq=noraman
keyword: PBEPBE/SDD
title: #p freq=noraman PBEPBE/SDD
converged: NO YES NO NO
title: Mulliken charges:
elementType: Cl O O N N N C C C C C C C C H H H H H H H H
charge: -0.059355 -0.256542 -0.232619 -0.478027 -0.167747 0.037126 0.509255 -0.425195 -0.355716 0.324103 -0.044884 -0.186762 -0.252760 -0.622508 0.354233 0.259313 0.303547 0.235798 0.260492 0.260047 0.278126 0.260075
chargesum: 0.00000
title: Mulliken charges with hydrogens summed into heavy atoms:
elementType: Cl O O N N N C C C C C C C C
charge: -0.059355 -0.256542 -0.232619 -0.123794 -0.167747 0.037126 0.509255 -0.165881 -0.052169 0.324103 -0.044884 0.049036 0.007732 0.175740
polarizability: 2.06701441e+02 -3.74697113e+00 1.43371139e+02 1.15937336e-02 1.29897730e-02 5.25088435e+01
1716.lowfreq: -9.5353 -0.0021 -0.0020 0.0011 4.3725 5.0106 36.3495 60.5282 84.9519
frequency: 35.8283 60.5139 84.9518 101.3062 121.5731 180.6690 192.8336 198.4242 224.2975 268.3217 314.8984 347.4188 369.2253 391.5030 408.5828 439.4278 489.2926 564.4394 601.1423 671.5426 684.4243 693.1906 765.1839 788.6481 792.5564 846.2715 861.2214 872.3898 912.5140 925.7115 979.7763 990.5323 1073.3042 1095.4641 1099.3221 1115.6239 1181.4378 1184.9738 1245.7579 1277.9503 1307.0024 1369.8712 1379.6165 1414.6839 1421.3332 1460.9225 1470.5542 1475.0911 1529.8952 1587.4408 1614.1043 1660.8193 3009.2529 3094.4033 3150.8146 3153.4104 3154.1392 3182.1962 3201.2042 3430.8056
redmass: 5.9973 4.5783 9.9933 5.2777 1.0945 6.1250 5.4395 10.0064 7.3605 5.0870 3.9242 5.5258 7.1232 6.1810 9.0663 3.0582 10.6955 4.9904 7.0197 7.5558 2.6033 4.8906 5.4151 1.2503 1.3122 6.3248 5.7962 1.5436 1.3738 3.2325 5.9710 1.3168 2.3335 2.4192 1.8667 1.3293 1.0940 2.5184 1.8371 4.2783 1.5192 8.3121 6.1512 1.3441 2.5426 1.0427 1.0815 2.5828 2.2349 4.6878 6.3164 8.7751 1.0338 1.1010 1.0891 1.0930 1.1008 1.0956 1.0955 1.0765
irintensity: 0.0146 0.3855 0.0947 10.8901 0.8935 1.6549 0.1162 9.6109 9.3814 1.0242 4.8500 17.4887 8.2059 1.8458 6.9545 7.8844 1.1631 0.5763 25.2151 32.3653 25.5915 1.2001 39.8449 105.1004 7.9015 74.3609 33.1887 67.8197 5.6317 256.8151 8.0626 3.5910 25.2942 116.1924 10.8462 0.4930 0.8414 20.0313 10.2500 30.7378 8.2179 190.7043 28.6762 26.9609 110.5280 23.1315 21.1932 82.8404 477.4179 223.1217 76.9731 214.7535 12.7472 11.5230 10.6384 1.5328 0.3656 2.4872 4.6355 73.6643
temp: 298.150 k
press: 1.00000 atm
elementType: 17 8 8 7 7 7 6 6 6 6 6 6 6 6 1 1 1 1 1 1 1 1
symmnumber: 1
zpe: 409840.7 jmol-1
zpe.correction: 0.156100 hartree
zpe.thermalcorrener: 0.169295 hartree
zpe.thermalcorrenthalpy: 0.170239 hartree
zpe.thermalcorrgfe: 0.114973 hartree
zpe.sumelectzpe: -1083.352634 hartree
zpe.sumelectthermal: -1083.339439 hartree
zpe.sumelectthermalent: -1083.338495 hartree
zpe.sumelectthermalfe: -1083.393761 hartree
dipole: 0.7927 1.5868 0.0014
dipole: 1.7738
quadrupole: -86.3250 -93.2823 -89.5303
quadrupole: 0.5732 0.0084 -0.0045
quadrupole: 3.3875 -3.5698 0.1823 0.5732 0.0084 -0.0045
hfenergy: -1083.508734 hartree
pointgroup: C01 [X(C8H8Cl1N3O2)]
dipole: 0.2406419 -0.6550491 -0.0005632 debye
dipolederiv: -0.4574777 0.3063261 0.0000547 0.4145402 -0.5258258 -0.0000561 0.0000619 -0.000047 -0.0729104 -0.7370134 -0.0780399 -0.000003 0.4025588 -0.9742559 -0.0002141 0.0000192 -0.0000076 -0.3487287 -0.9578832 -0.7770138 -0.00037 -0.2942633 -0.5927758 -0.0000181 -0.0007891 -0.0008037 -0.1806734 -1.9979472 0.126843 0.0001911 0.4752822 -0.4246145 -0.0000462 0.0003436 -0.0000109 -0.2958743 -0.8637079 -0.2760547 -0.0002439 -1.0245189 -1.0046288 -0.0003757 0.0002134 0.000142 -0.1195484 0.3067864 0.6563756 0.0006071 0.9202795 1.1674243 0.0004714 0.0009339 0.0007806 -0.0502643 1.3626914 0.0275265 -0.0001821 0.232805 0.1541697 -0.0000385 -0.0002177 -0.0000156 0.1146141 -0.4856376 0.0978685 0.0000374 0.2511568 -0.1710415 -0.0000493 0.0000398 -0.0000216 -0.1685548 -0.3340638 -0.0100572 0.0000144 -0.2110734 -0.1185901 0.0000314 0.0000805 0.0000119 -0.1763861 2.4783358 0.3168337 -0.000077 -0.5285956 1.340335 0.0002109 -0.0002444 0.000088 0.3068209 0.7234283 -0.4329964 -0.0001174 -0.6784403 0.8369376 0.0000886 -0.0001224 0.0000632 -0.0378697 0.1940049 -0.055645 -0.0000513 0.0865192 0.174652 -0.0000148 -0.0000654 0.0000074 -0.1254154 -0.2359484 0.1327619 0.0000014 0.1732097 -0.3442316 -0.0000214 0.0000086 -0.000021 -0.1408579 0.1993277 0.0017 -0.0000104 -0.1600504 0.042232 0.000045 -0.0002894 -0.0001371 0.2024897 0.3666875 0.0428069 0.0000173 0.1059238 0.1778417 -0.0000282 -0.0000782 -0.0000568 0.2994066 0.0647386 -0.0677325 0.0000241 -0.0707756 -0.0008803 0.0000158 0.000021 0.0000165 0.1787429 0.1445777 0.0634881 0.0000148 0.0453771 0.0770687 -0.0000008 -0.0000033 -0.0000176 0.184549 0.0429795 -0.0441248 0.0000203 -0.0669873 -0.077803 0.0000145 0.0000153 0.0000114 0.1547019 -0.0401107 -0.0215421 0.0000404 -0.0092163 0.1038311 0.0000031 0.0000451 0.0000047 0.1765909 0.013639 0.026781 0.0525378 -0.0363592 0.0709839 0.0736685 0.0761496 0.0171913 -0.0225889 0.1989822 -0.0629052 -0.0000102 0.0089223 0.0180979 -0.0000191 0.0000275 -0.0000379 0.1443176 0.0136109 0.0268001 -0.0524954 -0.0362943 0.0710734 -0.0736671 -0.0761495 -0.0171402 -0.0225614 unknown
polarizability: 206.7476333|-3.3335111|143.3249467|-0.0100798|0.0141967|52.5088435 unknown
InChI: InChI=1S/C8H8ClN3O2/c1-12(11-14)8(13)10-7-4-2-3-6(9)5-7/h2-5,10H,1H3
charge 0 multiplicity 1
22 atoms
Cl -4.258974 2.158447 0.000421
O  1.537067 -1.9797 -0.000658
O  4.04213 1.875211 0.000764
N  0.537818 0.167552 -0.000429
N  2.887777 -0.051695 -0.000762
N  2.881026 1.343326 -0.000598
C  -0.850942 -0.13429 -0.000165
C  -1.742668 0.972974 -0.000012
C  -1.360572 -1.459641 -0.000059
C  1.590989 -0.722142 -0.000701
C  -3.124085 0.727394 0.000242
C  -2.757009 -1.658615 0.000204
C  -3.662558 -0.572929 0.000355
C  4.139331 -0.826164 -0.000865
H  0.817685 1.15769 -0.000425
H  -1.364418 2.000181 -0.000106
H  -0.67219 -2.305822 -0.000181
H  -3.150331 -2.680406 0.000292
H  -4.743627 -0.731938 0.000562
H  4.735756 -0.575085 -0.894544
H  3.871702 -1.891258 -0.000981
H  4.735795 -0.57529 0.892845
