program: Gaussian 09
title: 000146803
version: EM64L-G09RevD.01
frameworkgroup: C1[X(C24H16O8)]
method: RPBEPBE
basis: SDD
operation: Freq
keyword: #pfreq=noraman
keyword: PBEPBE/SDD
title: #p freq=noraman PBEPBE/SDD
converged: YES YES NO NO
title: Mulliken charges:
elementType: O O O O O O O O C C C C C C C C C C C C C C C C C C C C C C C C H H H H H H H H H H H H H H H H
charge: -0.393216 -0.392985 -0.296174 -0.182941 -0.370693 -0.389458 -0.407462 -0.242322 0.201641 -0.595541 0.299870 -0.631561 0.043944 0.468476 -0.075822 0.020037 0.318628 -0.723720 0.023040 -0.752049 0.400088 0.066352 0.039392 -0.308030 0.168001 0.352178 -0.823701 0.217319 -0.574340 0.051182 0.350160 -0.602523 0.284289 0.236775 0.242088 0.235742 0.343112 0.248972 0.234634 0.225194 0.271522 0.388952 0.322214 0.380629 0.222375 0.362633 0.378339 0.364760
chargesum: 0.00000
title: Mulliken charges with hydrogens summed into heavy atoms:
elementType: O O O O O O O O C C C C C C C C C C C C C C C C C C C C C C C C
charge: -0.004264 -0.012355 -0.296174 -0.182941 -0.008060 -0.011120 -0.042702 -0.242322 0.201641 -0.074477 0.299870 -0.153731 0.043944 0.468476 -0.075822 0.020037 0.318628 -0.380608 0.023040 -0.503078 0.400088 0.066352 0.039392 -0.308030 0.168001 0.352178 -0.092351 0.217319 -0.252126 0.051182 0.350160 -0.380148
polarizability: 5.96869514e+02 2.43303951e+01 3.44716948e+02 -6.01611307e+00 5.25279915e+00 1.36158065e+02
1716.lowfreq: -8.3366 -1.6652 -0.0005 0.0008 0.0011 2.8143 22.9443 30.6693 43.3055
frequency: 22.9002 30.6498 43.3034 53.7027 60.3876 66.0254 86.5503 116.9117 122.5234 129.7322 145.5861 163.1173 171.5080 188.1215 203.3744 210.0901 228.7711 233.5145 258.7568 274.1116 284.8361 296.3294 303.6050 316.5457 329.6759 343.0327 357.9277 378.9208 384.8675 386.6684 408.8243 416.3182 428.3062 449.4336 455.8086 464.3655 477.0338 496.7241 517.2723 519.6608 527.1243 542.3533 546.0594 558.1719 574.0969 587.2596 599.3231 610.0130 614.0837 615.8782 638.3748 670.4853 677.7618 694.0375 710.1977 722.2690 743.1334 753.4465 764.0741 783.8226 800.5157 813.3220 848.4775 849.6061 874.9194 898.7670 928.6959 952.2280 954.9394 966.2153 987.0075 989.8740 998.1956 1000.5015 1017.7614 1031.7582 1047.4719 1055.3067 1076.3003 1088.8581 1119.3028 1150.5843 1157.0408 1171.3822 1180.1495 1187.2110 1196.6060 1215.7801 1223.0769 1234.9252 1251.8319 1289.2765 1298.0894 1305.3561 1319.3978 1334.1949 1334.8646 1343.5026 1353.3178 1370.9293 1397.6614 1403.9229 1406.6007 1414.7065 1419.9939 1435.5091 1455.0454 1457.8505 1460.3531 1463.9073 1473.3436 1488.3237 1491.6689 1538.4593 1548.2870 1557.0748 1569.9659 1587.8480 1605.6854 1615.0728 1629.1893 1635.0527 2594.5202 2965.3427 2975.1259 2988.7814 3052.4017 3070.8978 3077.9186 3099.2422 3105.9602 3131.7403 3133.4648 3182.3120 3503.7786 3506.1397 3537.7855 3576.1482
redmass: 6.9187 7.1990 8.5401 7.7026 6.4242 7.6505 6.2570 2.4888 3.5535 1.9917 6.6115 3.7820 6.9417 5.7234 4.3213 5.2861 5.0797 6.9028 3.6402 4.6893 5.5973 5.2822 5.1365 3.7272 6.3563 4.2557 5.2076 5.1706 1.2984 3.2313 1.3656 3.9036 6.5597 6.1889 3.6519 3.1042 2.2365 4.5348 5.5873 3.4129 4.8741 4.2244 7.9172 4.8216 3.2127 3.4298 4.2561 4.4191 4.6384 3.6842 3.4130 4.3093 4.6959 4.3839 5.7371 5.6614 5.5286 5.5996 7.0369 4.9035 6.2723 1.8733 3.5290 3.9961 1.3542 3.3408 1.5272 2.9053 2.2875 2.8897 4.2659 1.0691 2.6322 4.4751 3.0314 2.1847 1.6044 2.5975 3.3042 3.0211 2.0725 1.3502 1.5225 1.5962 1.4304 1.9140 2.2051 1.6107 1.4423 1.7754 1.7886 2.3350 1.5481 2.9782 3.0527 4.6708 5.6009 4.2339 3.4108 4.5699 4.8310 1.3094 5.9480 3.7349 7.1599 4.1082 1.2091 1.5807 1.0648 1.6872 1.4060 3.2340 3.3037 4.8839 6.6419 4.6746 6.3933 6.0641 5.6943 6.7132 6.6389 8.0942 1.0731 1.0688 1.0652 1.0380 1.0957 1.0954 1.0923 1.1004 1.0915 1.0912 1.0915 1.0927 1.0638 1.0658 1.0658 1.0662
irintensity: 2.0458 0.4593 2.8203 1.0329 2.3927 1.7490 0.1729 1.3201 0.7809 0.5984 1.0576 0.6176 3.5364 1.6315 4.5106 1.6108 0.3383 1.3390 0.3152 4.9696 2.0757 9.6116 5.4962 2.0575 6.2092 9.8369 2.5681 12.9703 121.5983 87.9630 80.9460 5.0248 18.0271 7.5449 16.0874 15.5896 87.2317 20.2842 4.6601 21.6268 3.5024 41.1156 17.2528 6.9542 41.6735 29.7683 18.1995 26.5557 14.7270 24.8331 49.3796 16.0844 6.3846 9.9141 28.9831 9.7081 11.8504 7.8150 2.7583 3.5521 1.9624 47.9652 11.8234 17.7455 17.7808 33.9878 9.8769 42.5465 13.7648 14.9817 26.9144 125.9025 19.1242 2.7245 231.1908 7.6012 11.4744 15.5342 4.6067 238.5212 139.4713 89.7558 113.3413 90.8867 54.2237 131.4146 1.6058 26.7083 4.0615 22.1190 76.3618 200.6195 3.0089 66.5777 1.4463 42.2055 1033.5809 197.0330 33.0407 178.0756 72.1243 11.2283 48.7537 93.5764 6.5136 6.7211 30.8189 5.4851 9.5320 32.9904 49.1497 56.0577 33.7968 180.0164 14.9722 132.9234 52.4105 104.0694 471.0518 87.4410 105.4530 359.2281 338.7930 13.3440 24.2824 21.9989 30.7178 11.5230 6.0486 16.5524 20.3547 2.8866 17.5061 6.9515 28.6080 89.3041 40.6141 93.6431
temp: 298.150 k
press: 1.00000 atm
elementType: 8 8 8 8 8 8 8 8 6 6 6 6 6 6 6 6 6 6 6 6 6 6 6 6 6 6 6 6 6 6 6 6 1 1 1 1 1 1 1 1 1 1 1 1 1 1 1 1
symmnumber: 1
zpe: 906364.9 jmol-1
zpe.correction: 0.345216 hartree
zpe.thermalcorrener: 0.371881 hartree
zpe.thermalcorrenthalpy: 0.372825 hartree
zpe.thermalcorrgfe: 0.288842 hartree
zpe.sumelectzpe: -1523.781804 hartree
zpe.sumelectthermal: -1523.755139 hartree
zpe.sumelectthermalent: -1523.754195 hartree
zpe.sumelectthermalfe: -1523.838178 hartree
dipole: -6.6279 1.1750 -0.9726
dipole: 6.8012
quadrupole: -117.5522 -191.3980 -187.3612
quadrupole: 19.6116 -12.3511 -3.7545
quadrupole: 47.8849 -25.9609 -21.9241 19.6116 -12.3511 -3.7545
hfenergy: -1524.1270199 hartree
pointgroup: C01 [X(C24H16O8)]
dipole: -2.6025282 0.4877768 -0.385645 debye
polarizability: 597.1945465|22.9380327|343.9999359|-2.5160068|11.0759444|136.5500448 unknown
InChI: InChI=1S/C24H16O8/c1-8-4-9-2-3-11-12(17(9)22(29)16(8)24(31)32)7-14-19(21(11)28)23(30)18-13(20(14)27)5-10(25)6-15(18)26/h4-7,25-26,28-29,31H,2-3H2,1H3
charge 0 multiplicity 1
48 atoms
O  -1.166748 3.468286 0.534013
O  2.644204 -1.798578 0.896801
O  -3.492645 2.561978 0.491995
O  -1.593093 -2.514046 -0.584191
O  -5.982037 1.612275 0.465032
O  4.770757 -3.282946 -0.180443
O  -6.541155 -3.154873 -0.492392
O  6.392737 -2.356386 1.186837
C  0.688045 1.983423 0.206215
C  1.64941 3.150518 0.289157
C  1.196954 0.670476 -0.007893
C  2.815365 2.930352 -0.703158
C  2.669297 0.488095 -0.059216
C  3.488359 1.592969 -0.441014
C  -0.716133 2.192153 0.301652
C  -1.636934 1.096764 0.158911
C  -1.109031 -0.198138 -0.118399
C  0.280064 -0.405721 -0.209727
C  3.319217 -0.735455 0.293124
C  4.88301 1.437415 -0.551076
C  5.522772 0.202141 -0.288393
C  4.723646 -0.898817 0.135224
C  -3.084474 1.349409 0.259742
C  -2.030025 -1.347688 -0.325986
C  -4.019139 0.222886 0.082607
C  -3.508584 -1.089024 -0.208874
C  7.025509 0.079553 -0.452018
C  -5.441289 0.364017 0.180083
C  -4.357181 -2.192751 -0.395493
C  5.377302 -2.201624 0.465317
C  -5.754099 -2.020612 -0.29556
C  -6.296943 -0.749852 -0.008091
H  1.110345 4.089102 0.081226
H  2.052755 3.234203 1.319878
H  3.551563 3.749454 -0.621262
H  2.416575 2.956897 -1.738555
H  0.61144 -1.399465 -0.532643
H  5.493332 2.29603 -0.852553
H  7.291793 -0.72609 -1.161448
H  7.455221 1.022533 -0.827923
H  7.50857 -0.178269 0.506228
H  -2.212238 3.403469 0.572789
H  -3.927893 -3.172984 -0.616002
H  1.703978 -1.557557 1.10477
H  -7.385132 -0.616323 0.070965
H  -6.972247 1.5671 0.50596
H  5.216006 -4.123318 0.11693
H  -7.507404 -2.95718 -0.408547
