program: Gaussian 09
title: 000146696
version: EM64L-G09RevD.01
frameworkgroup: C1[X(C8H8N4O4)]
method: RPBEPBE
basis: SDD
operation: Freq
keyword: #pfreq=noraman
keyword: PBEPBE/SDD
title: #p freq=noraman PBEPBE/SDD
converged: NO YES NO NO
title: Mulliken charges:
elementType: O O O O N N N N C C C C C C C C H H H H H H H H
charge: -0.247205 -0.212984 -0.209703 -0.223092 -0.472038 -0.168560 0.021710 0.039456 0.504915 -0.415654 -0.310857 0.393754 -0.342159 -0.358190 0.329134 -0.619887 0.242574 0.308626 0.356244 0.290283 0.289129 0.279060 0.262714 0.262728
chargesum: 0.00000
title: Mulliken charges with hydrogens summed into heavy atoms:
elementType: O O O O N N N N C C C C C C C C
charge: -0.247205 -0.212984 -0.209703 -0.223092 -0.115794 -0.168560 0.021710 0.039456 0.504915 -0.173080 -0.002231 0.393754 -0.051876 -0.069061 0.329134 0.184615
polarizability: 2.62849435e+02 -4.93947239e+00 1.42309737e+02 2.58496801e-02 5.65627199e-03 5.45771488e+01
1716.lowfreq: -13.4629 -0.0009 -0.0005 0.0004 1.3636 2.4498 35.9109 46.2090 74.1742
frequency: 35.8694 46.2065 74.1715 84.0009 98.7169 123.2213 136.8654 176.8424 210.6019 223.5923 301.2226 316.3996 317.0699 368.7616 390.8344 415.8603 436.9095 482.9127 506.4877 513.2489 624.8804 642.4662 666.6166 694.9367 737.3268 753.9914 775.5432 798.6127 826.6074 849.2712 849.8459 877.3825 922.0871 982.6764 1000.0746 1006.1998 1084.3523 1097.2279 1117.1812 1120.7466 1180.9883 1183.6856 1225.0352 1256.9405 1290.2851 1303.6246 1360.6402 1377.0231 1400.3699 1419.3034 1429.1353 1462.1311 1470.6323 1487.4722 1530.8920 1598.6807 1613.7333 1659.0851 3009.5856 3095.5392 3136.2199 3153.7537 3179.9590 3188.4373 3201.5360 3417.4316
redmass: 9.0453 5.9776 5.6750 8.3942 4.1896 1.1876 5.3995 11.5529 7.1895 7.9674 6.0279 3.8385 6.1960 7.4221 6.1828 2.9900 7.7326 11.6536 3.1407 7.2013 7.2087 8.1227 4.6495 6.9112 4.3762 6.3421 7.6674 1.2462 5.9931 1.2754 6.2935 1.5807 3.1546 1.3473 3.1504 1.3289 4.5796 2.8683 1.3272 1.3045 1.5226 2.2536 4.4173 2.1907 4.4352 1.3709 7.8162 7.9717 6.2157 1.2759 4.1752 1.0422 1.0802 2.4217 2.2993 6.0495 5.7356 8.1967 1.0339 1.1012 1.0912 1.1009 1.0904 1.0947 1.0962 1.0766
irintensity: 1.1461 0.2613 0.5139 1.4935 11.5213 1.6735 0.3902 9.4237 0.3617 2.6981 9.7849 9.9667 0.7704 20.4664 1.9923 0.0017 7.1556 1.5492 17.6863 0.2852 0.4766 1.7798 27.5668 0.6841 0.6137 102.5587 3.4707 31.1991 40.6393 45.7609 68.8501 101.4377 312.5048 0.2413 0.0501 0.0582 139.3267 48.1023 0.4800 16.2792 160.1559 41.7624 445.4963 36.6460 2.4443 23.4117 118.8600 167.3032 102.9908 61.0613 81.0503 23.7958 19.2846 0.1092 802.5325 103.6597 160.2731 173.4004 11.3260 10.0435 7.8861 0.4173 1.9458 2.8370 2.5743 111.5631
temp: 298.150 k
press: 1.00000 atm
elementType: 8 8 8 8 7 7 7 7 6 6 6 6 6 6 6 6 1 1 1 1 1 1 1 1
symmnumber: 1
zpe: 438550.6 jmol-1
zpe.correction: 0.167035 hartree
zpe.thermalcorrener: 0.181562 hartree
zpe.thermalcorrenthalpy: 0.182507 hartree
zpe.thermalcorrgfe: 0.124047 hartree
zpe.sumelectzpe: -828.266610 hartree
zpe.sumelectthermal: -828.252083 hartree
zpe.sumelectthermalent: -828.251139 hartree
zpe.sumelectthermalfe: -828.309598 hartree
dipole: 5.6128 -0.2127 -0.0001
dipole: 5.6168
quadrupole: -122.3402 -93.8127 -91.3240
quadrupole: 9.7128 -0.0066 0.0019
quadrupole: -19.8479 8.6796 11.1683 9.7128 -0.0066 0.0019
hfenergy: -828.4336454 hartree
pointgroup: C01 [X(C8H8N4O4)]
dipole: -2.209225 0.0518919 -0.00004 debye
dipolederiv: -0.7281948 0.1275134 0.0000469 -0.4196204 -0.966709 0.0000886 0.0000968 0.0000609 -0.3422152 -0.8742017 -0.2084942 0.0000783 -0.3631879 -0.6682238 0.0000667 0.0001266 0.0000988 -0.2353012 -0.8413954 0.195746 0.0000262 0.3719652 -0.67104 0.0000395 0.0000274 0.0000109 -0.2324729 -1.1186082 0.7378748 0.0002052 0.2450326 -0.4671211 0.0000185 0.0005033 -0.0003836 -0.1717778 -2.4148214 -0.2615246 0.0002579 -0.7236086 -0.4669891 0.0001047 0.0002583 0.0000507 -0.2910648 -1.1447119 0.3037645 0.0002428 1.0929033 -0.8702966 -0.000202 -0.0001519 0.0001324 -0.1210357 2.2831315 0.0156767 -0.0001891 -0.0348294 1.0830487 -0.0001037 -0.000172 -0.0001119 0.1932782 0.5427506 -0.7551915 -0.0002902 -1.1012451 1.001391 0.0001864 -0.0004019 0.0002602 -0.0475041 1.8250452 0.1022959 -0.0001856 -0.138554 0.143234 0.0000122 -0.0001339 -0.0000128 0.1262476 -0.5795163 -0.1212744 0.0000572 -0.3918965 0.0135936 0.0000076 0.0000902 -0.0000159 -0.1873925 -0.5819965 0.0735307 0.0000309 0.3993278 -0.0580958 -0.0000517 -0.000048 -0.0000184 -0.1533923 -1.1173829 -0.0167651 0.0001205 0.018347 -0.0339106 0.0000056 0.0000876 0.0000113 0.0401746 0.3984308 0.0486679 -0.0000501 -0.2335194 0.0103053 0.0000111 -0.0000347 -0.0000186 -0.088498 0.4178915 -0.0479653 -0.0000398 0.2101832 0.0342859 -0.0000397 -0.0000903 -0.0000133 -0.0925816 2.7556996 -0.2398158 -0.0002922 0.880024 1.3277718 -0.000223 -0.0003333 -0.0000732 0.3172244 0.1852694 0.014745 -0.0000019 0.1965664 0.0586069 0.0000113 0.0001189 -0.0000349 0.198575 0.0116904 0.0955398 0.0000008 0.0871334 -0.0107062 0.0000162 0.0000072 0.0000153 0.1658842 0.1483673 -0.0480426 0.0000069 -0.0269955 0.0725267 0.0000183 0.0000187 0.0000155 0.1755339 0.4168145 -0.0262988 -0.0000139 -0.1379681 0.16768 0.0000262 0.0000478 0.0000025 0.298439 0.0988907 -0.0586889 0.0000141 -0.0182529 0.0653799 0.0000148 0.0000082 0.0000175 0.1711642 0.0983484 0.0498882 -0.0000016 0.0189537 0.0615091 0.0000155 0.000004 0.0000128 0.1675759 0.1906182 0.080036 -0.0000111 0.0155974 0.0302741 0.0000023 -0.0000146 -0.0000153 0.1455338 0.0139303 -0.0306078 -0.0581708 0.0268409 0.0717332 0.0673534 -0.0747263 0.009768 -0.0181973 0.0139507 -0.0306101 0.0581586 0.026803 0.0717521 -0.0673789 0.0747119 -0.0097591 -0.0181974 unknown
polarizability: 262.9666057|-3.203261|142.1925663|-0.0257656|-0.0060276|54.5771488 unknown
InChI: InChI=1S/C8H8N4O4/c1-11(10-14)8(13)9-6-2-4-7(5-3-6)12(15)16/h2-5,9H,1H3
charge 0 multiplicity 1
24 atoms
O  -2.049296 -1.96003 0.000377
O  4.994416 1.188053 -0.000653
O  4.933987 -1.093934 -0.000365
O  -5.014718 1.552226 0.00092
N  -1.333356 0.297931 0.000019
N  -3.635069 -0.221169 0.000282
N  4.357471 0.062612 -0.000391
N  -3.799174 1.167826 0.000186
C  0.075334 0.176868 -0.000091
C  0.825667 1.388173 -0.000315
C  0.748956 -1.077209 0.000032
C  2.880745 0.10289 -0.000315
C  2.227593 1.356561 -0.000433
C  2.154258 -1.108079 -0.000088
C  -2.269073 -0.722171 0.000218
C  -4.782935 -1.143431 0.000477
H  0.30393 2.352246 -0.000394
H  0.170993 -2.002565 0.000221
H  -1.73972 1.244267 -0.000065
H  2.822809 2.272848 -0.000597
H  2.69821 -2.056146 0.000012
H  -4.387864 -2.168232 0.000498
H  -5.405275 -0.967519 -0.893491
H  -5.405087 -0.967418 0.894555
