program: Gaussian 09
title: 000146690
version: EM64L-G09RevD.01
frameworkgroup: C1[X(C10H8N4O5)]
method: RPBEPBE
basis: SDD
operation: Freq
keyword: #p
keyword: freq=noraman
keyword: PBEPBE/SDD
title: #p freq=noraman PBEPBE/SDD
converged: NO YES NO NO
title: Mulliken charges:
elementType: O O O O O N N N N C C C C C C C C C C H H H H H H H H
charge: -0.225411 -0.188253 -0.175644 -0.218393 -0.196330 -0.197304 -0.406426 0.051800 0.048972 -0.462195 0.171902 0.275641 0.411848 -0.358688 -0.336059 -0.226237 0.272024 -0.302280 -0.179534 0.280732 0.280885 0.362239 0.269622 0.239174 0.217190 0.295470 0.295254
chargesum: 0.00000
title: Mulliken charges with hydrogens summed into heavy atoms:
elementType: O O O O O N N N N C C C C C C C C C C
charge: -0.225411 -0.188253 -0.175644 -0.218393 -0.196330 -0.197304 -0.044186 0.051800 0.048972 0.099423 0.171902 0.275641 0.411848 -0.089065 -0.096884 -0.009048 0.272024 -0.006810 0.115720
polarizability: 4.72675793e+02 -1.06959061e+01 1.80995649e+02 3.70364098e-03 2.06341985e-03 6.32869479e+01
1716.lowfreq: -7.8485 0.0005 0.0011 0.0015 2.9271 4.3433 23.7282 33.2729 37.7138
frequency: 23.7182 33.2477 37.6987 67.3577 84.8457 106.5624 148.1294 161.7931 171.1853 183.7777 215.5946 224.5494 252.5257 286.0304 368.1903 369.1371 398.0238 402.6498 450.9296 487.7316 520.7619 547.4197 561.8962 581.2919 628.0546 655.7850 660.5854 664.1171 677.8321 712.4053 724.0228 768.2453 804.2604 814.6091 866.3246 878.1004 905.6901 909.8572 919.2932 924.9014 988.3325 994.5047 1027.0326 1079.0331 1125.3529 1157.1526 1160.2470 1164.3761 1187.4690 1214.3949 1230.8101 1250.1270 1266.2205 1277.6951 1297.3736 1313.7644 1332.8093 1340.2306 1356.6972 1391.1240 1449.0371 1470.3507 1525.4666 1570.3431 1630.4618 1694.3654 1729.2403 2998.2080 3019.8492 3057.8199 3124.0367 3152.6371 3228.9679 3259.3371 3582.4083
redmass: 10.9036 10.0486 7.3214 8.7352 9.5216 5.4823 5.1536 4.9045 5.9885 10.6512 7.8389 3.4845 2.6687 6.7441 10.3634 3.2338 6.3991 8.9314 7.0682 5.7870 6.2766 2.2015 5.4354 7.6915 4.8620 7.4717 4.1861 1.5778 8.5895 4.4442 10.1292 5.5847 1.2970 5.1362 1.5990 3.5442 1.3830 9.4871 1.6860 6.0136 1.2586 1.5715 1.2609 5.2385 3.6293 4.5874 1.0997 6.5411 2.3625 2.8329 2.4024 1.3962 4.6854 2.2658 2.8923 1.5824 1.7876 5.1697 4.0897 2.9090 1.1106 8.2962 6.5231 5.1497 5.9490 8.4975 11.9526 1.0587 1.0870 1.1049 1.0919 1.0905 1.0961 1.1030 1.0803
irintensity: 0.6570 0.3896 0.1064 0.0553 2.3016 5.2478 5.9754 0.8495 2.8721 5.3579 1.0131 5.7649 2.9513 13.6883 9.0268 0.1880 0.9111 7.3782 4.1925 8.1395 9.6490 12.8616 0.9325 5.9335 58.4653 2.7849 0.5580 69.8676 9.7766 75.4031 20.1152 0.3993 55.8244 22.4644 11.0218 30.7509 4.2606 12.5397 14.3711 0.6578 66.5604 21.6744 36.6070 115.5143 260.9776 325.2830 1.0671 41.6078 396.5110 313.4896 253.9858 16.1497 210.3245 51.5896 105.7229 167.5036 56.3656 10.3143 247.0883 76.7075 135.0496 396.3928 24.5771 13.4680 54.3489 675.0227 485.6910 5.2385 59.8535 4.6252 9.0652 5.8169 0.9379 5.2030 135.1835
temp: 298.150 k
press: 1.00000 atm
elementType: 8 8 8 8 8 7 7 7 7 6 6 6 6 6 6 6 6 6 6 1 1 1 1 1 1 1 1
symmnumber: 1
zpe: 477587.6 jmol-1
zpe.correction: 0.181904 hartree
zpe.thermalcorrener: 0.198458 hartree
zpe.thermalcorrenthalpy: 0.199403 hartree
zpe.thermalcorrgfe: 0.135010 hartree
zpe.sumelectzpe: -979.498260 hartree
zpe.sumelectthermal: -979.481705 hartree
zpe.sumelectthermalent: -979.480760 hartree
zpe.sumelectthermalfe: -979.545153 hartree
dipole: -3.2574 -7.9311 0.0006
dipole: 8.5740
quadrupole: -138.2617 -114.4664 -107.5906
quadrupole: -26.2294 -0.0128 0.0015
quadrupole: -18.1555 5.6398 12.5157 -26.2294 -0.0128 0.0015
hfenergy: -979.6801631 hartree
pointgroup: C01 [X(C10H8N4O5)]
dipole: 1.2480318 -3.1338852 -0.0049918 debye
polarizability: 472.8710196|7.5673595|180.7997567|-0.4701428|0.1128835|63.2876134 unknown
InChI: InChI=1S/C10H8N4O5/c15-8-6-13(10(16)12-8)11-5-1-2-7-3-4-9(19-7)14(17)18/h1-5,12H,6H2
charge 0 multiplicity 1
27 atoms
O  -3.085287 0.151317 0.004996
O  6.566378 -1.364103 -0.007944
O  3.99312 2.587145 0.000469
O  -6.559256 1.042065 0.009807
O  -4.670157 2.36119 0.008797
N  3.367189 0.261574 -0.002411
N  5.562007 0.787921 -0.004229
N  2.015296 0.482572 0.000208
N  -5.269238 1.215303 0.008717
C  4.088126 -1.033987 -0.004996
C  5.569823 -0.610088 -0.007239
C  4.258616 1.374895 -0.002453
C  -2.573128 -1.167479 0.003164
C  -3.64803 -2.076844 0.004061
C  -1.149754 -1.354165 0.001448
C  1.201353 -0.568744 0.000376
C  -4.478874 0.020618 0.006802
C  -4.859223 -1.31956 0.006058
C  -0.221661 -0.332299 0.001827
H  3.862589 -1.636479 -0.904588
H  3.865567 -1.63831 0.894121
H  6.403057 1.3668 -0.00354
H  -3.557399 -3.161187 0.00309
H  -0.819645 -2.400809 -0.000144
H  1.555841 -1.615855 -0.001777
H  -5.883002 -1.683735 0.007051
H  -0.549507 0.713846 0.00343
