program: Gaussian 09
title: 000146688
version: EM64L-G09RevD.01
frameworkgroup: C1[X(C9H9NO3)]
method: RPBEPBE
basis: SDD
operation: Freq
keyword: #pfreq=noraman
keyword: PBEPBE/SDD
title: #p freq=noraman PBEPBE/SDD
converged: YES YES NO NO
title: Mulliken charges:
elementType: O O O N C C C C C C C C C H H H H H H H H H
charge: -0.163540 -0.241371 -0.258117 -0.326038 0.266289 -0.342488 -0.360543 0.167721 -0.217855 -0.226408 -0.224155 0.317123 -0.744722 0.272446 0.240343 0.234321 0.232705 0.234239 0.358038 0.256382 0.268660 0.256969
chargesum: 0.00000
title: Mulliken charges with hydrogens summed into heavy atoms:
elementType: O O O N C C C C C C C C C
charge: -0.163540 -0.241371 -0.258117 0.032000 0.266289 -0.070042 -0.120201 0.167721 0.016466 0.006297 0.010085 0.317123 0.037290
polarizability: 1.79667288e+02 5.79046302e-01 1.16880693e+02 -6.49638815e+00 5.74367798e+00 5.77319057e+01
1716.lowfreq: -9.9030 -4.8733 0.0007 0.0009 0.0010 3.4294 27.9518 54.8390 58.4988
frequency: 27.9203 54.8336 58.4844 69.9147 80.4156 163.3491 190.7984 252.2855 270.7851 298.6885 386.2415 402.3687 430.8454 489.2623 499.2514 576.3631 613.2265 621.4813 653.8694 680.8564 703.4423 784.4280 789.0055 859.4812 916.5703 935.7764 954.5740 986.2165 989.8526 1001.6136 1005.5370 1027.0077 1043.5623 1079.9930 1109.4206 1174.5104 1177.6594 1190.6862 1231.8351 1318.2564 1384.4008 1391.5639 1410.5610 1437.1848 1455.1285 1456.6105 1479.5960 1580.3119 1609.1227 1610.3262 1667.4553 3010.4492 3098.8914 3126.8386 3135.2999 3140.8996 3147.8141 3159.8992 3171.2006 3446.2737
redmass: 5.1798 2.3790 6.8807 1.3035 6.2203 4.8928 4.8158 6.8796 7.3126 6.0440 4.6244 2.8492 3.8183 1.4223 3.8229 2.9544 6.3496 4.8449 6.7912 4.6220 1.6078 4.2236 2.6078 1.2472 5.7922 1.6508 3.8740 1.5208 4.3639 2.2371 1.3436 2.2612 1.5648 1.6793 2.6802 1.0991 2.9667 1.1309 2.8445 1.3200 9.1241 1.2388 1.7357 2.2059 1.0457 1.0707 2.2368 7.0291 6.7467 8.3360 9.2773 1.0365 1.0976 1.0862 1.0880 1.1009 1.0924 1.0960 1.1010 1.0795
irintensity: 0.0529 3.5300 3.5305 0.0828 3.0583 5.8786 12.2925 0.3830 8.0672 1.9582 9.4855 0.1947 12.1603 84.9838 20.5436 33.9918 0.7157 11.2367 7.3736 8.7564 72.2993 10.2247 44.5461 1.1649 101.9912 15.2944 17.6814 1.8211 0.6269 28.2021 1.3756 2.2585 13.2032 17.7178 1.6742 27.2031 337.2282 1.2622 72.0192 1.1369 1.2874 4.0111 246.2534 48.3162 20.2577 19.9987 6.6408 94.1339 76.9532 167.8785 92.5609 1.4876 3.6669 3.3825 2.9735 3.5821 19.1355 15.6720 20.2644 77.6630
temp: 298.150 k
press: 1.00000 atm
elementType: 8 8 8 7 6 6 6 6 6 6 6 6 6 1 1 1 1 1 1 1 1 1
symmnumber: 1
zpe: 430778.2 jmol-1
zpe.correction: 0.164075 hartree
zpe.thermalcorrener: 0.176536 hartree
zpe.thermalcorrenthalpy: 0.177480 hartree
zpe.thermalcorrgfe: 0.123254 hartree
zpe.sumelectzpe: -627.803240 hartree
zpe.sumelectthermal: -627.790779 hartree
zpe.sumelectthermalent: -627.789835 hartree
zpe.sumelectthermalfe: -627.844061 hartree
dipole: 0.2394 -2.3116 0.4200
dipole: 2.3616
quadrupole: -49.0562 -82.7896 -77.3437
quadrupole: 4.2436 -2.6097 5.6500
quadrupole: 20.6737 -13.0598 -7.6138 4.2436 -2.6097 5.6500
hfenergy: -627.9673146 hartree
pointgroup: C01 [X(C9H9N1O3)]
dipole: 0.1037013 -0.9213238 0.0607578 debye
dipolederiv: -1.0941715 0.3450812 -0.0507535 0.6982986 -0.5792858 0.1331223 -0.1999301 0.137166 -0.1055715 -0.6570921 -0.1690603 -0.0171436 0.1799953 -0.9970308 0.0227034 -0.0491605 -0.0122555 -0.3355877 -0.5761166 -0.2027499 0.0464637 0.4419935 -0.9592021 0.1519614 -0.0979438 0.1246948 -0.3511726 -0.5732649 0.3269161 -0.0403494 0.6346867 -0.5312158 -0.0691589 0.0545989 -0.1240985 -0.3206566 -0.3516552 -0.100452 0.0104014 -0.1089648 -0.1173598 0.0246088 0.0379417 0.0154206 -0.0068051 -0.0448853 0.0884408 0.0115705 -0.0936013 0.0313857 0.0729655 -0.0387789 0.0305769 -0.0994117 -0.0135476 -0.0328973 -0.0751144 0.1208031 -0.0342549 0.0431504 -0.0724961 0.0510695 -0.0996701 1.7768719 -0.0807335 0.0146199 -0.6453302 1.3586811 -0.0413338 0.0220564 0.0397055 0.2416381 0.0396154 -0.1247585 -0.0977711 -0.1158988 -0.056154 0.0606053 -0.0860795 0.0639005 -0.1028245 -0.178511 0.0267137 0.0136603 0.0646401 0.0965483 0.0959044 0.0371354 0.0964908 -0.1041664 0.0901086 0.0745318 -0.0277509 0.0363648 -0.0220536 0.0416555 -0.0404636 0.037563 -0.1199146 1.5431758 -0.1072987 0.0519309 -1.0442172 1.4058071 -0.2820242 0.2671613 -0.2561175 0.2802141 -0.4524013 -0.1027099 0.0098694 0.0028599 -0.0504284 0.012756 -0.0102601 0.0079902 0.010091 0.1327902 -0.042033 -0.0070497 -0.0015692 0.0118943 -0.0666799 -0.0183764 -0.0477773 0.1342431 -0.0072164 0.0742972 0.0760678 0.071529 0.0593254 -0.0518457 0.0883047 -0.0429184 0.1075994 -0.0470492 0.0684321 0.0692871 0.0754879 0.0437905 -0.0661191 0.0806304 -0.0644765 0.1149262 0.0697685 -0.0344917 0.003563 -0.0613788 -0.0683952 -0.0923555 -0.0018601 -0.0953461 0.1153306 -0.0934788 -0.0800873 0.0188579 -0.084295 0.0713176 -0.0214299 0.0164308 -0.0183552 0.1466024 0.2192499 0.0128928 -0.0031268 -0.1547557 0.1951433 0.0278657 0.0066675 0.052988 0.3358735 0.0396126 0.0255292 0.0498428 0.0147589 0.068205 -0.0840011 0.0831306 -0.0640456 0.0426407 0.1223354 0.0328003 -0.0072792 -0.0101012 -0.0407645 0.0345097 0.0004414 0.034803 0.1316303 0.0558616 0.0016368 -0.0497961 -0.0213055 0.1140465 0.0531398 -0.0791501 0.033022 -0.0150086 unknown
polarizability: 179.6414848|1.9782382|114.8502872|-6.4375134|12.2163837|59.7881157 unknown
InChI: InChI=1S/C9H9NO3/c1-7(11)13-10-9(12)8-5-3-2-4-6-8/h2-6,10H,1H3
charge 0 multiplicity 1
22 atoms
O  2.473323 0.56045 -0.145786
O  0.252266 2.193701 -0.046092
O  3.108565 -1.626034 0.355182
N  1.13155 0.024076 -0.128032
C  -1.272554 0.284544 -0.045692
C  -2.344146 1.036852 0.499609
C  -1.520105 -1.015319 -0.561104
C  0.083845 0.943523 -0.070795
C  -3.641924 0.488143 0.551997
C  -2.821513 -1.560898 -0.508834
C  -3.88301 -0.814238 0.052956
C  3.441676 -0.44351 0.119794
C  4.821607 0.153065 0.059213
H  -2.136416 2.047783 0.865351
H  -0.718106 -1.588691 -1.040386
H  -4.464396 1.07323 0.977352
H  -3.009306 -2.560458 -0.915598
H  -4.891941 -1.239559 0.091344
H  1.105376 -0.972195 0.12849
H  5.407094 -0.356748 -0.725501
H  4.780046 1.231037 -0.15286
H  5.335571 -0.017355 1.020792
