program: Gaussian 09
title: 000146686
version: EM64L-G09RevD.01
frameworkgroup: C1[X(C12H11NOS)]
method: RPBEPBE
basis: SDD
operation: Freq
keyword: #p
keyword: freq=noraman
keyword: PBEPBE/SDD
title: #p freq=noraman PBEPBE/SDD
converged: YES YES NO NO
title: Mulliken charges:
elementType: S O N C C C C C C C C C C C C H H H H H H H H H H H
charge: 0.216896 -0.411601 -0.372221 -0.274549 -0.164181 0.426856 -0.196575 -0.192561 -0.399144 -0.356154 -0.170087 -0.254376 -0.240514 -0.211617 -0.242417 0.258428 0.258106 0.228858 0.257474 0.253777 0.238697 0.225471 0.226673 0.227682 0.296484 0.370596
chargesum: 0.00000
title: Mulliken charges with hydrogens summed into heavy atoms:
elementType: S O N C C C C C C C C C C C C
charge: 0.216896 -0.041005 -0.075737 -0.274549 -0.164181 0.426856 0.061852 0.065545 -0.170286 -0.098680 0.083689 -0.015679 -0.015043 0.015056 -0.014735
polarizability: 2.46103994e+02 -6.99732423e+00 1.31698416e+02 -3.53847797e+00 1.42172864e+00 1.06909660e+02
1716.lowfreq: -15.7592 -6.1286 -0.0018 -0.0010 -0.0004 2.9362 7.5022 29.0753 39.1976
frequency: -7.6118 29.0133 39.1842 91.4369 139.0375 165.1382 189.2665 231.8054 266.2932 310.8716 354.7091 386.1617 401.3494 408.9652 423.3100 467.9549 481.8712 531.5212 588.3869 611.0779 626.9140 667.5721 681.2309 693.6286 711.6134 744.0296 814.4531 835.7409 839.4553 841.2624 904.6540 946.4444 964.3993 969.1833 971.1033 982.7823 988.4826 993.3898 1016.9840 1062.2935 1079.2302 1082.9430 1110.4921 1170.5112 1178.9499 1187.1795 1247.6486 1287.1803 1306.8092 1318.0885 1346.3927 1376.4670 1406.5751 1427.2894 1442.1746 1460.7789 1477.7869 1579.7395 1585.2504 1591.7460 1607.0492 3123.3090 3124.6765 3129.9571 3143.0924 3150.3815 3153.6387 3160.1085 3166.0000 3181.3298 3453.2473 3520.0556
redmass: 4.3781 4.0140 5.8609 4.7400 4.8757 4.6926 6.9737 5.3547 5.3306 3.3359 1.4953 8.0621 2.8623 3.0205 6.7595 3.2069 3.3708 3.1800 3.0889 6.3042 6.6507 6.7398 3.2017 2.2745 3.8493 1.4849 1.5128 1.5254 2.5118 1.2657 1.3733 1.3446 1.9050 1.9106 1.4939 6.3497 1.3062 3.7007 3.3986 2.4424 1.5933 2.8160 1.3371 1.0496 1.1120 1.1190 1.9819 1.2872 1.3250 1.4723 2.8594 7.9730 4.4111 2.2031 1.3895 2.0330 2.5628 5.8588 6.2590 5.9560 6.2213 1.0846 1.0888 1.0878 1.0929 1.0899 1.0950 1.0956 1.1014 1.0950 1.0770 1.0685
irintensity: 0.6624 0.0962 0.5523 0.6285 3.0883 0.1708 0.3201 0.6909 5.3348 5.2240 72.9864 1.2482 0.0961 0.4020 23.9144 10.8295 38.7195 24.9449 222.9592 2.7914 9.7723 24.1999 108.8874 27.6268 1.2001 80.0908 21.9051 19.1801 94.3471 4.8359 1.3289 0.6963 18.1375 16.2555 6.6653 4.7754 0.0405 17.6276 27.8209 13.0773 4.3947 2.8372 5.5397 0.1886 20.1442 1.9222 7.3690 1.5813 1.3957 114.5362 6.7110 2.2159 0.0380 8.5532 23.9515 65.2782 75.6451 0.5510 0.2601 58.8187 85.5247 2.3970 13.6049 2.5735 19.4510 5.3408 20.2890 6.5342 28.1969 3.5696 7.2000 32.5700
temp: 298.150 k
press: 1.00000 atm
elementType: 16 8 7 6 6 6 6 6 6 6 6 6 6 6 6 1 1 1 1 1 1 1 1 1 1 1
symmnumber: 1
zpe: 520070.8 jmol-1
zpe.correction: 0.198085 hartree
zpe.thermalcorrener: 0.210865 hartree
zpe.thermalcorrenthalpy: 0.211809 hartree
zpe.thermalcorrgfe: 0.157532 hartree
zpe.sumelectzpe: -990.789545 hartree
zpe.sumelectthermal: -990.776765 hartree
zpe.sumelectthermalent: -990.775820 hartree
zpe.sumelectthermalfe: -990.830097 hartree
dipole: -2.7994 1.2142 0.7462
dipole: 3.1413
quadrupole: -71.3720 -98.2593 -90.0625
quadrupole: 0.0523 -1.5052 1.5796
quadrupole: 15.1926 -11.6947 -3.4979 0.0523 -1.5052 1.5796
hfenergy: -990.9876296 hartree
pointgroup: C01 [X(C12H11N1O1S1)]
dipole: -1.0663648 -0.2795771 -0.5586654 debye
dipolederiv: -0.2714152 0.1761295 0.1372804 0.3402614 -0.1054361 0.0201927 0.2551207 0.0129171 -0.0725652 -0.3575637 -0.1794822 -0.1753099 -0.6437769 -0.4172461 0.0209324 -0.2570431 0.0330036 -0.2926628 -1.3226086 -0.0305459 -0.2537566 0.6347219 0.1158273 -0.0483526 -0.0672769 -0.1364647 0.012236 0.2598735 0.0383881 0.0692053 0.0472282 -0.2007879 -0.038424 0.0834875 -0.0513548 -0.1710798 0.5998369 -0.4203173 -0.3279096 -0.6140428 0.1860921 0.1715409 -0.4714233 0.1810856 0.0829185 1.328164 0.2966513 0.2910371 0.2023296 0.0498492 0.0879474 0.4315449 0.1623037 0.1433001 0.036144 0.0489482 0.0706298 -0.0578897 0.0185814 -0.0782007 0.1659239 -0.0589303 0.0503024 0.0571656 0.071898 0.0533193 0.1306854 0.0432842 -0.0817434 -0.0818876 -0.0771255 0.0232176 -0.4357816 -0.0548946 -0.0187941 -0.2836784 -0.1474022 -0.1783387 0.0917271 -0.0948537 -0.0359612 -0.4134406 -0.0175422 -0.0251681 0.1623273 -0.0328841 -0.0453287 -0.2612821 -0.1376507 -0.1665238 -0.2029904 0.0984933 0.0866957 0.246505 -0.2140081 -0.0736415 0.2136347 -0.0835983 -0.1726081 -0.3692005 0.1608125 0.1322864 0.2287131 -0.0802201 0.0742994 0.1916041 0.0725405 -0.0606892 0.1344975 -0.016041 0.0114038 -0.0259681 0.0085059 0.1390977 0.0047757 0.1378459 -0.0138968 0.1269186 -0.0104757 0.0194339 -0.0500025 -0.0164063 0.1183813 -0.0213875 0.1208163 -0.0358037 -0.1180863 -0.0655906 -0.0516349 -0.0302439 -0.1171036 0.0612809 -0.0210975 0.0589805 -0.1363473 0.0946266 -0.0931949 0.0255229 -0.0823883 0.0356032 0.0678475 0.0311445 0.0522774 0.0764113 0.1042159 0.0170007 -0.0840768 0.0257888 0.0737381 0.0582383 -0.0796229 0.0666044 0.0242444 0.0145068 0.0238099 -0.1038164 0.0041133 0.0885228 0.0830249 -0.1172982 0.0947375 -0.003955 0.0462403 -0.0688784 0.015154 -0.0752629 0.0475533 0.086762 0.0081113 0.0731492 0.0982125 0.0000644 -0.0295346 -0.0429096 -0.0762196 0.0997931 -0.0225493 -0.088166 -0.0195221 0.0963155 0.1151181 -0.006538 -0.012167 -0.0423235 0.032098 -0.1212263 -0.0423569 -0.11815 0.0439164 0.0553653 -0.0333502 -0.04031 -0.000733 0.0084214 -0.1352707 -0.0094908 -0.1370796 0.022979 -0.1522262 -0.0222169 -0.0502998 -0.0168477 0.1123591 -0.0439741 -0.0468127 -0.0439393 0.111347 -0.0431201 0.0900537 0.0636737 0.1020419 0.0575187 -0.0921177 0.0734308 -0.092492 0.088057 0.3844858 -0.0770899 0.0797688 -0.244567 0.1212918 0.00942 -0.085488 0.0292193 0.0577532 0.32921 0.1035072 0.1307417 0.1192284 0.2324551 -0.0397976 0.1001284 -0.04432 0.2308819 unknown
polarizability: 244.7411951|8.0258089|123.3745991|12.4135148|12.591261|116.5962763 unknown
InChI: InChI=1S/C12H11NOS/c14-13-10-6-8-12(9-7-10)15-11-4-2-1-3-5-11/h1-9,13-14H
charge 0 multiplicity 1
26 atoms
S  0.973969 1.456186 1.367066
O  -4.899533 -1.697517 -0.340972
N  -4.465682 -0.339562 -0.7003
C  -0.630051 0.850195 0.701367
C  2.210469 0.384264 0.501215
C  -3.161257 -0.002817 -0.249629
C  -1.222292 1.489593 -0.414406
C  -1.308509 -0.217036 1.334578
C  -2.477645 1.067352 -0.893098
C  -2.566917 -0.647909 0.866082
C  1.857125 -0.600323 -0.448996
C  3.571738 0.596227 0.835378
C  2.870029 -1.372059 -1.064334
C  4.574998 -0.179675 0.214175
C  4.230328 -1.167633 -0.73869
H  -0.696376 2.313087 -0.907802
H  -0.846983 -0.715089 2.193424
H  -2.930095 1.573197 -1.754713
H  -3.080209 -1.488778 1.338763
H  0.806442 -0.766545 -0.707535
H  3.845942 1.358716 1.573542
H  2.589462 -2.134445 -1.800128
H  5.625231 -0.010509 0.47772
H  5.010532 -1.76832 -1.218563
H  -4.622779 -0.224015 -1.710584
H  -5.664339 -1.539784 0.274439
