program: Gaussian 09
title: 000146683
version: EM64L-G09RevD.01
frameworkgroup: C1[X(C9H7N3O2S)]
method: RPBEPBE
basis: SDD
operation: Freq
keyword: #p
keyword: freq=noraman
keyword: PBEPBE/SDD
title: #p freq=noraman PBEPBE/SDD
converged: YES YES NO NO
title: Mulliken charges:
elementType: S O O N N N C C C C C C C C C H H H H H H H
charge: 0.321676 -0.222091 -0.226282 -0.352729 -0.059642 0.088332 0.463546 -0.157535 -0.444310 -0.324392 -0.082414 -0.195010 -0.219467 -0.212969 -0.246416 0.327975 0.224115 0.315777 0.233744 0.232736 0.299729 0.235627
chargesum: 0.00000
title: Mulliken charges with hydrogens summed into heavy atoms:
elementType: S O O N N N C C C C C C C C C
charge: 0.321676 -0.222091 -0.226282 -0.024754 -0.059642 0.088332 0.463546 -0.157535 -0.220195 -0.008615 -0.082414 0.038733 0.013268 0.086760 -0.010790
polarizability: 3.27773686e+02 5.16745390e-02 1.47247844e+02 7.41616576e-03 2.02005130e-02 5.17763957e+01
1716.lowfreq: -6.1152 -5.9759 -0.0009 0.0003 0.0014 5.5121 42.2476 47.5111 86.5928
frequency: 42.2434 47.4834 86.5803 94.5592 113.6846 169.6825 227.9623 246.0431 282.3286 285.2047 389.9811 408.1276 463.9654 474.4580 503.5075 549.7457 592.7246 604.9188 615.5428 616.0692 668.4049 691.6588 695.8289 726.3844 767.5957 808.3668 813.0603 842.7891 889.5362 922.2688 977.4944 985.4067 1005.9936 1024.4331 1053.2973 1060.0763 1090.8044 1175.2023 1191.5446 1206.6073 1232.5760 1248.7821 1309.6134 1326.6450 1336.7942 1384.1995 1436.2120 1479.9949 1481.5284 1517.9358 1558.6434 1605.7867 1611.2830 3112.3132 3138.5017 3150.6457 3170.2086 3191.3488 3214.1085 3529.4686
redmass: 7.7105 5.0542 7.5825 12.5089 7.2657 8.4025 4.8181 9.1252 6.4804 7.2836 10.4569 2.9148 13.3802 3.8870 2.6620 9.8224 9.0829 5.5057 6.7103 1.3903 10.9820 6.9657 2.0306 13.4131 1.6490 6.4725 6.6019 1.2657 1.4229 1.4049 1.3543 6.1771 1.3111 2.4069 5.1954 3.8460 1.5644 1.0563 1.1242 3.4695 3.6253 1.7243 7.9481 1.3834 12.7064 7.0765 2.2647 2.4169 5.2900 1.7844 7.8266 4.4070 5.9650 1.0894 1.0869 1.0933 1.0995 1.0957 1.0963 1.0762
irintensity: 0.5317 0.0222 1.3489 0.2115 0.4187 4.1388 0.2950 1.1875 6.1745 4.1277 0.2931 0.0206 2.6120 0.0167 45.6724 20.5960 0.3471 0.0746 0.4947 54.3936 9.3386 4.6256 43.6699 9.2397 100.9359 0.9948 7.0165 0.0937 15.6892 11.3642 0.1672 0.0085 2.3276 4.8305 45.1129 22.7857 12.8143 0.2474 1.1955 619.2490 205.9929 19.8660 67.9596 5.7936 126.5465 3.8092 12.4871 16.6489 415.2224 29.9415 839.7235 68.7270 5.6221 12.0114 0.0415 23.1248 24.1099 12.7572 3.6988 65.0048
temp: 298.150 k
press: 1.00000 atm
elementType: 16 8 8 7 7 7 6 6 6 6 6 6 6 6 6 1 1 1 1 1 1 1
symmnumber: 1
zpe: 397448.2 jmol-1
zpe.correction: 0.151380 hartree
zpe.thermalcorrener: 0.164027 hartree
zpe.thermalcorrenthalpy: 0.164972 hartree
zpe.thermalcorrgfe: 0.110805 hartree
zpe.sumelectzpe: -1058.763313 hartree
zpe.sumelectthermal: -1058.750665 hartree
zpe.sumelectthermalent: -1058.749721 hartree
zpe.sumelectthermalfe: -1058.803888 hartree
dipole: 7.5445 -1.6744 0.0091
dipole: 7.7281
quadrupole: -113.5171 -84.9778 -97.1651
quadrupole: -2.8716 -0.0317 -0.0409
quadrupole: -14.9637 13.5755 1.3882 -2.8716 -0.0317 -0.0409
hfenergy: -1058.9146928 hartree
pointgroup: C01 [X(C9H7N3O2S1)]
dipole: -2.9805866 0.5984793 -0.0489434 debye
dipolederiv: -0.3362927 -0.0578037 0.0066216 -0.4187832 -0.2496877 0.0387143 0.0418092 0.0382328 0.1417866 -0.9922938 0.2125359 -0.0190672 0.7088998 -0.6616332 0.0395191 -0.0666349 0.0403929 -0.2456699 -0.8802397 -0.1635679 0.0173407 -0.5530566 -0.638901 0.0393977 0.0553973 0.0386612 -0.2509639 -2.1123431 0.0045318 0.0027867 0.6140104 -0.2611929 -0.0002908 -0.0549275 0.0005131 -0.2604811 -1.313617 0.0452257 -0.0019401 1.1413417 -0.7143843 0.0458072 -0.1038459 0.0473225 -0.2186629 2.7060679 -0.029129 -0.0025369 -0.0115901 1.0061268 -0.0752077 -0.005733 -0.0750979 0.2456597 1.2008733 0.189959 -0.0184934 0.5803095 0.1449502 -0.0056624 -0.0557328 -0.0046405 0.0949727 2.0383917 0.0518286 -0.0101897 -1.3527591 0.762967 -0.0667543 0.1218841 -0.0690659 0.0546695 -0.2979797 -0.0404733 0.0041202 -0.0289875 0.0587251 -0.0243072 0.0021745 -0.0244854 -0.1997855 -0.177465 -0.0254415 0.0026872 -0.1671361 -0.1290409 -0.0022173 0.0156797 -0.0024298 -0.1520342 -1.5754173 -0.1810715 0.0207529 -0.6506289 0.2075791 -0.0281174 0.0661636 -0.029315 -0.1017261 0.1323301 -0.0338547 0.0030884 -0.1467211 0.0697571 -0.019099 0.0141987 -0.0192131 -0.1314229 -0.0792468 0.0017914 0.000064 0.1437124 0.1768858 -0.0299283 -0.0136747 -0.0295693 -0.1344771 1.3535651 -0.0033124 -0.0028396 0.2447452 0.1108283 -0.0102806 -0.0280634 -0.0093965 0.0103763 -0.0481326 0.067979 -0.0060807 -0.0134699 -0.1010967 -0.0062627 0.0017007 -0.0063752 -0.1693016 0.1266276 -0.0183619 0.0020495 -0.1424839 0.1710854 0.0134808 0.0149484 0.0131935 0.3117707 0.0820071 -0.0823294 0.0076439 -0.0480165 -0.0993503 0.0254335 0.0045291 0.0254307 0.1686247 0.1760487 0.0592798 -0.0059163 0.0858248 0.0853912 0.0083882 -0.0083834 0.0085033 0.1738261 -0.0614419 0.0914186 -0.0085897 0.1146692 0.0112872 0.0139807 -0.0107343 0.0139687 0.1583959 0.0644266 -0.0188429 0.0017634 -0.0669935 -0.0954423 0.0236853 0.0063058 0.0235856 0.1523719 0.0994696 -0.0019805 0.0003791 0.0414213 0.0780057 0.0101637 -0.0037268 0.0102951 0.1843146 -0.1053379 -0.0683809 0.0063559 -0.074308 0.0671405 0.0095573 0.0066655 0.0094891 0.1677566 unknown
polarizability: 327.7015722|3.5362092|146.4553664|-0.7557383|-9.0442835|52.6409869 unknown
InChI: InChI=1S/C9H7N3O2S/c13-12(14)8-6-10-9(15-8)11-7-4-2-1-3-5-7/h1-6,11H
charge 0 multiplicity 1
22 atoms
S  1.904602 1.490815 -0.162211
O  4.867765 -1.204554 0.091256
O  4.866283 1.088635 -0.132261
N  -0.84032 1.009454 -0.106549
N  0.638748 -0.899903 0.071771
N  4.264806 -0.059623 -0.018777
C  -2.136818 0.409989 -0.050662
C  0.39088 0.413913 -0.053094
C  -3.248268 1.291704 -0.134122
C  -2.343255 -0.987471 0.081561
C  2.835837 -0.058968 -0.015348
C  -4.559318 0.779038 -0.086177
C  -3.664162 -1.482436 0.127813
C  1.993814 -1.1616 0.092912
C  -4.775717 -0.612885 0.045202
H  -0.843977 2.028194 -0.199566
H  -3.088579 2.373239 -0.23589
H  -1.483078 -1.655674 0.145909
H  -5.409629 1.466094 -0.151052
H  -3.821805 -2.561643 0.229715
H  2.352792 -2.186278 0.190308
H  -5.794801 -1.01114 0.082162
