program: Gaussian 09
title: 000146681
version: EM64L-G09RevD.01
frameworkgroup: C1[X(C5H5N5O)]
method: RPBEPBE
basis: SDD
operation: Freq
keyword: #pfreq=noraman
keyword: PBEPBE/SDD
title: #p freq=noraman PBEPBE/SDD
converged: NO NO NO NO
title: Mulliken charges:
elementType: O N N N N N C C C C C H H H H H
charge: -0.428623 -0.320197 0.017391 0.020275 -0.036797 -0.596425 0.130571 -0.025611 0.164627 -0.148933 -0.352447 0.339664 0.290763 0.257494 0.334534 0.353716
chargesum: 0.00000
title: Mulliken charges with hydrogens summed into heavy atoms:
elementType: O N N N N N C C C C C
charge: -0.428623 0.019467 0.017391 0.020275 -0.036797 0.091825 0.130571 -0.025611 0.164627 0.141829 -0.094953
polarizability: 1.15329151e+02 -4.03723398e+00 1.11184761e+02 -1.47511278e+00 1.55490778e-02 4.54567747e+01
1716.lowfreq: -14.9480 -9.1207 -7.5241 -0.0008 -0.0007 -0.0005 115.7569 152.6401 175.3100
frequency: 115.7445 152.6389 175.3092 218.8651 281.1643 343.5929 461.4552 495.8574 530.1639 537.8819 571.5073 615.4416 655.4093 662.5172 694.9045 737.9766 774.6467 797.8566 806.6744 855.4167 908.4597 942.5678 968.3806 1016.3729 1154.5128 1192.5427 1222.5956 1252.2074 1270.6063 1289.3551 1313.7812 1389.2706 1441.4971 1517.5161 1553.9033 1572.8117 1653.4534 3130.9313 3176.3908 3237.3105 3382.3261 3630.8241
redmass: 6.3856 6.6838 7.9708 5.4055 5.0642 5.2298 4.3002 7.0036 3.6425 4.4549 1.3477 4.8376 6.2801 5.4054 1.9512 1.6419 9.0360 7.8845 7.1029 2.1017 6.1827 1.4726 3.0059 4.9722 2.8196 1.8595 1.5398 1.8706 1.1060 10.2496 2.5401 1.6759 3.7779 6.2206 8.7726 1.4445 4.6958 1.0728 1.0926 1.1015 1.0558 1.0941
irintensity: 16.8655 24.0399 11.0567 4.0205 7.8224 9.3801 19.1344 0.7245 14.0209 9.0259 111.8017 18.3776 2.4786 14.4675 72.8391 87.4587 9.2272 50.7160 17.6594 35.2517 12.6229 11.1464 8.0445 9.8863 1.8226 29.6718 4.3445 28.6692 28.4725 49.6974 26.7856 5.6532 30.4104 132.1258 27.3987 9.8214 496.0808 7.1813 12.3668 2.6051 87.2659 95.0001
temp: 298.150 k
press: 1.00000 atm
elementType: 8 7 7 7 7 7 6 6 6 6 6 1 1 1 1 1
symmnumber: 1
zpe: 291306.5 jmol-1
zpe.correction: 0.110953 hartree
zpe.thermalcorrener: 0.119367 hartree
zpe.thermalcorrenthalpy: 0.120311 hartree
zpe.thermalcorrgfe: 0.077631 hartree
zpe.sumelectzpe: -541.607026 hartree
zpe.sumelectthermal: -541.598612 hartree
zpe.sumelectthermalent: -541.597668 hartree
zpe.sumelectthermalfe: -541.640348 hartree
dipole: -0.6383 2.5637 2.9976
dipole: 3.9957
quadrupole: -61.0890 -67.9174 -62.9465
quadrupole: 5.7987 -7.1297 0.4241
quadrupole: 2.8953 -3.9331 1.0378 5.7987 -7.1297 0.4241
hfenergy: -541.7179788 hartree
pointgroup: C01 [X(C5H5N5O1)]
dipole: -0.1279813 1.01514 1.1934593 debye
dipolederiv: -0.6168643 -0.0276546 0.0022428 0.0087445 -0.5370278 -0.0074129 0.1126644 -0.1874145 -0.3645061 0.0693025 -0.098998 0.0148592 0.0030951 -0.1321642 -0.2409765 -0.2854306 0.2078537 0.5009419 -0.5097318 0.2792991 0.0155772 0.0835482 -0.3930377 0.0351014 0.0040073 -0.1454659 -0.1988674 -0.9678695 0.1331111 0.0650454 -0.0214982 -0.4930894 -0.0002627 0.0142668 -0.0541504 -0.1810437 -0.4143917 0.3035029 -0.0055276 -0.1786773 -0.8109765 -0.0215752 0.0309834 0.0345224 -0.2215226 -0.246828 0.0038521 -0.0074203 -0.1271223 -1.3585204 -0.0806102 -0.0781727 -0.2129265 -0.6086845 -0.1611077 -0.3254788 -0.0501869 -0.1973009 -0.6163802 -0.01495 0.0666936 -0.0724768 -0.1214384 0.877869 -0.2597039 -0.0484188 -0.1107318 0.4536067 0.0777469 -0.0403392 0.1325525 0.1634646 0.2414679 0.0668397 0.0084115 0.2159254 1.6379721 0.0131938 -0.0468143 -0.0795296 0.2303912 0.2776218 -0.1432042 0.008013 0.0071489 0.7142614 0.112245 0.1386221 0.2034598 -0.0675112 0.7401406 -0.0559419 -0.0369072 0.1990838 0.619053 0.026238 0.0075078 0.0363265 -0.0291962 0.1457261 -0.017375 -0.001558 -0.0003396 0.1494707 0.0726513 0.0082321 -0.0007877 -0.0877598 0.0789922 -0.006256 0.0107259 0.0209322 0.0919307 -0.0119032 -0.0178737 -0.0339882 0.170165 -0.0264692 0.0650933 0.0111385 0.0646415 0.0637837 -0.0090398 0.0130111 -0.0186962 0.1228844 0.179215 0.0400152 0.0139141 0.041614 0.2875485 0.024829 0.0431629 0.052782 0.3608232 0.3329272 0.0428991 0.0000911 -0.0090635 0.3235692 0.0247252 0.0294787 0.1379391 0.3318596 unknown
polarizability: 114.4241126|-4.323408|111.9844764|-2.9613794|0.9759397|45.5620976 unknown
InChI: InChI=1S/C5H5N5O/c6-4-3-5(8-1-7-4)9-2-10(3)11/h1-2,10H,6H2
charge 0 multiplicity 1
16 atoms
O  -1.8926 1.716627 -0.503076
N  -1.520219 0.683577 0.447795
N  -1.444016 -1.660076 -0.065397
N  1.060433 -1.825139 -0.167063
N  2.23391 0.342034 -0.016297
N  0.976801 2.384313 0.09185
C  -0.122557 0.240544 0.313217
C  -0.083101 -1.134187 0.043957
C  1.037429 1.023187 0.143437
C  -2.242359 -0.660014 0.161014
C  2.17837 -1.013561 -0.12393
H  -1.735766 0.98719 1.426801
H  -3.330502 -0.63258 0.110183
H  3.139899 -1.525607 -0.220583
H  1.830676 2.91353 -0.078569
H  0.046098 2.785662 -0.095738
