program: Gaussian 09
title: 000146679
version: EM64L-G09RevD.01
frameworkgroup: C1[X(C9H12O3S)]
method: RPBEPBE
basis: SDD
operation: Freq
keyword: #p
keyword: freq=noraman
keyword: PBEPBE/SDD
title: #p freq=noraman PBEPBE/SDD
converged: NO YES NO NO
title: Mulliken charges:
elementType: S O O O C C C C C C C C C H H H H H H H H H H H H
charge: 1.060272 -0.398766 -0.502150 -0.529161 -0.547468 -0.297169 0.483139 -0.362348 -0.431968 -0.243248 -0.228779 -0.738488 -0.252750 0.226687 0.217781 0.234151 0.250975 0.244646 0.236793 0.234336 0.230363 0.310944 0.280905 0.287779 0.233525
chargesum: 0.00000
title: Mulliken charges with hydrogens summed into heavy atoms:
elementType: S O O O C C C C C C C C C
charge: 1.060272 -0.398766 -0.502150 -0.529161 -0.103000 0.187957 0.483139 -0.117702 -0.195175 -0.008912 0.001584 0.141140 -0.019225
polarizability: 1.29555065e+02 -1.21501803e+01 1.30256215e+02 -5.27462230e+00 -1.52108004e+00 1.16763344e+02
1716.lowfreq: -8.9329 -0.0019 -0.0014 -0.0012 6.5032 11.7952 39.1943 44.1501 49.9725
frequency: 38.5113 44.1209 49.6757 80.1245 123.4641 158.7247 176.3871 202.8632 232.8938 247.6681 272.8848 329.9705 343.9322 393.3176 400.1949 403.5562 478.3187 484.4359 577.4451 589.8036 616.8530 704.1427 748.9940 757.6453 824.1605 830.4381 856.7611 908.5813 917.5161 946.9503 972.7133 978.7255 990.7516 995.1220 997.4346 1027.3453 1033.7401 1043.7957 1095.6850 1172.1966 1187.2285 1194.5704 1213.4793 1223.1069 1313.2950 1318.8748 1345.6977 1355.7358 1381.6064 1411.0449 1415.2078 1437.6175 1455.4544 1458.0737 1485.3341 1590.6300 1612.6828 2967.6985 2978.9821 3035.4637 3041.9661 3056.8355 3120.9247 3127.7687 3138.5676 3149.1101 3165.4468 3185.2306 3192.8509
redmass: 4.4320 5.3844 5.0638 5.4997 3.8874 1.1703 5.7964 3.0602 4.6525 3.3705 5.1408 2.5794 6.6827 5.8196 3.5416 2.8727 4.1572 5.1111 3.4365 6.9978 6.3729 2.0721 1.8847 2.3501 3.5019 8.0950 1.2520 1.5487 2.8680 2.2009 2.1318 1.3935 4.6687 1.4028 1.4013 2.1500 2.1479 1.9921 1.6250 1.0568 1.2152 1.1527 2.2808 1.1634 1.3705 1.1350 1.3329 1.2396 6.1804 1.0520 1.0552 1.9187 1.0727 1.1728 2.3083 5.9128 6.0771 1.0601 1.0649 1.0244 1.0999 1.0988 1.0862 1.0868 1.0919 1.0963 1.1015 1.1079 1.1078
irintensity: 0.2922 4.1760 0.2725 8.5806 0.9238 1.0213 0.6473 4.0933 0.1817 2.8222 5.2834 11.6093 25.2712 17.6101 11.4239 0.3686 12.1445 36.6215 22.8048 41.5858 0.2246 41.1588 58.6046 14.9826 30.1460 45.9746 1.2764 5.3400 42.5005 7.5667 51.9789 0.9379 3.2623 9.6017 3.3087 4.0481 40.2043 48.7048 12.7841 0.1063 1.9472 0.2000 0.6157 3.5183 1.0431 0.7012 0.0549 8.2824 0.0284 10.8906 5.8201 5.5683 16.2991 14.6823 16.4286 0.9609 4.9471 7.4188 43.4728 3.8840 24.3271 22.9129 4.2028 0.6204 15.3730 33.0834 15.7943 0.5013 4.8219
temp: 298.150 k
press: 1.00000 atm
elementType: 16 8 8 8 6 6 6 6 6 6 6 6 6 1 1 1 1 1 1 1 1 1 1 1 1
symmnumber: 1
zpe: 506070.2 jmol-1
zpe.correction: 0.192752 hartree
zpe.thermalcorrener: 0.206620 hartree
zpe.thermalcorrenthalpy: 0.207565 hartree
zpe.thermalcorrgfe: 0.151080 hartree
zpe.sumelectzpe: -972.722614 hartree
zpe.sumelectthermal: -972.708746 hartree
zpe.sumelectthermalent: -972.707801 hartree
zpe.sumelectthermalfe: -972.764286 hartree
dipole: 4.3074 -0.4022 -1.2437
dipole: 4.5014
quadrupole: -102.9291 -73.0026 -84.1300
quadrupole: -3.8303 -1.1935 4.0473
quadrupole: -16.2419 13.6846 2.5573 -3.8303 -1.1935 4.0473
hfenergy: -972.915366 hartree
pointgroup: C01 [X(C9H12O3S1)]
dipole: -1.5707124 0.5428193 -0.6120447 debye
dipolederiv: 1.5398443 0.0758439 0.1250008 0.2967703 1.3348711 0.0994632 0.240366 0.1591877 1.2174455 -0.6599945 -0.2305248 -0.1392891 -0.3425446 -0.7452059 -0.2252181 -0.147526 -0.1167848 -0.4719232 -0.7949403 -0.0399462 -0.0631549 -0.1132728 -0.5185534 -0.001377 0.0013467 0.018569 -0.4342507 -0.579822 0.0239004 0.0249871 -0.0539233 -0.5033976 0.0309255 -0.0039984 0.0218343 -0.6180517 -0.0433755 0.0392843 -0.0375383 -0.0449136 -0.018945 -0.0577748 -0.0321784 0.058842 0.1648274 0.5165102 0.2070225 0.1073288 0.2720568 0.5028672 0.1951268 -0.0465489 -0.128828 0.0491607 0.0168233 -0.1068385 -0.0381731 -0.2028148 0.1518803 0.035135 -0.0906258 0.037753 -0.059235 -0.131105 -0.0481611 0.067695 -0.0232885 -0.0906924 -0.0616583 0.0890426 -0.1174398 -0.0167339 -0.17288 -0.0063178 -0.0373287 0.015073 -0.1423749 -0.005312 -0.0104471 0.0287177 0.0964445 -0.1380536 -0.0477444 -0.0332839 -0.063798 -0.0587427 0.0222583 -0.068716 0.0248165 0.1211403 -0.114795 -0.0887917 0.0350578 -0.0852242 0.0102284 -0.0781245 0.0512843 -0.0841778 0.0416926 -0.1362556 0.0057143 0.0023435 -0.0212715 -0.0844083 0.0222517 -0.0269171 0.0074554 -0.0608878 -0.1174227 -0.1182977 -0.0373912 -0.115268 0.011557 0.0391728 -0.0331199 0.0337444 -0.0668671 0.049307 0.0303453 0.0092406 0.038965 0.0784555 0.0443296 -0.0043184 -0.0545667 -0.1290799 -0.0291615 -0.0916843 -0.0028778 -0.0259054 -0.1186444 0.0097292 0.0306104 0.0515123 0.0694066 -0.0994909 0.0470887 0.0013879 0.0377938 -0.1635182 -0.0721296 0.0095137 -0.0827633 0.0791419 0.0751122 -0.0538197 -0.0012216 -0.0334035 0.1003453 -0.0389161 0.0228295 0.0654271 -0.0218066 0.1186271 0.077483 -0.0629855 0.0732259 0.0169688 0.0641236 -0.0540301 0.0643957 0.0242066 0.1309999 0.0358515 0.0638552 0.0296144 0.0876212 -0.0480586 0.0367702 -0.0288866 -0.0844979 0.1311866 0.0337004 0.0272782 0.0448918 0.0933128 -0.0252361 0.054163 -0.0314885 -0.0975421 0.1110173 0.0707053 -0.0377835 0.0935998 0.0096734 0.0940152 -0.0501069 0.0970838 -0.0089551 0.0769079 0.0223046 0.0141497 0.0684586 0.0212549 0.0263606 0.0083918 0.0320325 0.0623699 0.0792966 0.0137058 -0.030056 -0.0122529 0.0010042 -0.0417039 -0.0458852 -0.0279955 0.0574105 0.0855157 0.037536 0.0085659 0.0361294 0.0573766 0.0202728 0.0316388 0.0198772 0.0161162 0.0861488 0.1116401 0.0341932 0.1313024 -0.0329339 -0.0476555 0.0384613 -0.0483175 0.0704681 unknown
polarizability: 125.9891685|-13.8553387|130.263185|1.5960789|4.0091675|120.3222709 unknown
InChI: InChI=1S/C9H12O3S/c1-13(10,11)12-8-7-9-5-3-2-4-6-9/h2-6H,7-8H2,1H3
charge 0 multiplicity 1
25 atoms
S  2.472385 0.239764 0.557446
O  1.848054 -0.84394 -0.867092
O  4.067281 0.413191 0.390177
O  1.842504 -0.327245 1.944652
C  -0.372909 -1.920373 -1.005596
C  1.057237 -2.014667 -0.429965
C  -1.148629 -0.693149 -0.545273
C  -1.404526 -0.458862 0.832274
C  -1.622207 0.253734 -1.489404
C  -2.112268 0.689877 1.251871
C  -2.332619 1.404738 -1.074675
C  1.60149 1.845223 0.045536
C  -2.578855 1.628025 0.300093
H  -0.311905 -1.932104 -2.108841
H  -0.901611 -2.848569 -0.703924
H  1.581627 -2.911135 -0.809074
H  1.041183 -2.059129 0.678861
H  -1.041424 -1.168767 1.584402
H  -1.428977 0.089188 -2.556305
H  -2.297759 0.852676 2.319328
H  -2.692573 2.121994 -1.820988
H  0.525289 1.639635 0.111047
H  1.940716 2.614211 0.753585
H  1.931361 2.04001 -0.983427
H  -3.130466 2.516975 0.625692
