program: Gaussian 09
title: 000146674
version: EM64L-G09RevD.01
frameworkgroup: C1[X(C13H14N2)]
method: RPBEPBE
basis: SDD
operation: Freq
keyword: #pfreq=noraman
keyword: PBEPBE/SDD
title: #p freq=noraman PBEPBE/SDD
converged: YES YES NO NO
title: Mulliken charges:
elementType: N N C C C C C C C C C C C C C H H H H H H H H H H H H H H
charge: -0.709537 -0.697749 -0.717316 0.562810 0.526440 -0.657013 -0.454015 -0.367576 -0.426680 0.512512 -0.412272 -0.412643 0.480522 -0.192249 -0.450419 0.215254 0.221359 0.219597 0.224753 0.236309 0.242478 0.211120 0.211301 0.214260 0.213344 0.301617 0.302754 0.300851 0.300188
chargesum: 0.00000
title: Mulliken charges with hydrogens summed into heavy atoms:
elementType: N N C C C C C C C C C C C C C
charge: -0.105165 -0.096710 -0.280703 0.562810 0.526440 -0.437417 -0.229262 -0.131267 -0.184202 0.512512 -0.201152 -0.201342 0.480522 0.022011 -0.237074
polarizability: 2.28047256e+02 5.38181681e+00 1.24039189e+02 -2.16665723e+01 9.66821813e-01 1.16587977e+02
1716.lowfreq: -16.0435 -3.1974 -0.0004 0.0002 0.0005 5.6275 20.4367 25.5573 55.6646
frequency: 20.2341 25.4861 55.6634 139.9097 193.0304 216.7871 225.2302 288.2288 306.9474 325.6159 330.2786 355.2088 365.7042 385.2938 398.4980 410.1573 439.3738 497.7833 511.0517 526.7717 554.0440 628.3257 641.4115 698.1407 711.5321 752.5374 766.5041 791.1812 814.8243 821.3963 831.4203 866.1997 874.5774 917.9217 937.5077 953.2480 959.4129 965.5263 982.2295 1002.0766 1016.3083 1033.5714 1099.0399 1125.9890 1175.0098 1176.6245 1184.4478 1189.5797 1216.3932 1284.0809 1309.9905 1315.1255 1323.5173 1332.5616 1384.6147 1390.7367 1433.1699 1457.9188 1464.3251 1492.2846 1519.2605 1582.9723 1595.9485 1625.6631 1632.0625 1640.3194 1643.7549 2961.2515 3006.8859 3100.1343 3105.3229 3109.9070 3112.7715 3128.8970 3131.8437 3137.7325 3153.0817 3568.8379 3570.1599 3710.0560 3710.7772
redmass: 4.1853 3.9173 4.6062 4.3504 4.3090 3.4374 4.6433 2.4613 1.2428 3.9815 1.2541 1.0415 1.0413 2.6696 2.6645 2.7216 2.8362 3.7394 3.6035 4.9427 3.8984 4.6168 6.2294 1.8918 3.2685 3.9865 3.1307 1.6871 1.3000 1.9056 3.6797 1.5766 1.5630 1.9040 1.7925 1.4480 1.6494 1.4334 5.7585 2.8230 1.4319 1.5658 1.4928 1.2426 1.6805 1.0981 1.1539 1.0955 2.2144 1.6062 3.1600 1.6117 1.6483 1.5757 5.1269 7.0769 3.1371 1.2637 2.5264 2.6958 3.0459 6.6839 6.0952 3.7985 1.7525 1.3290 2.2133 1.0597 1.0999 1.0906 1.0866 1.0870 1.0861 1.0961 1.0917 1.0967 1.0983 1.0447 1.0447 1.1040 1.1040
irintensity: 0.8554 0.6608 1.2271 3.4953 3.6005 8.1349 2.1183 11.6821 245.9326 67.5429 303.0304 0.0462 0.2152 2.2767 1.8888 0.3184 2.8381 12.0514 7.4112 4.3812 4.1792 3.1336 0.6246 27.3778 1.8186 10.5378 10.5922 56.4231 5.4491 45.7098 13.3569 11.2644 14.5510 2.5386 6.5924 3.0228 4.9012 3.7289 8.9366 0.8964 0.0529 5.0848 13.2978 22.0740 13.8245 2.8344 10.7002 14.0146 4.3832 5.5376 64.0402 18.9493 21.2958 13.7640 16.6278 10.4399 0.8191 12.8158 25.3245 61.7105 146.0117 4.6497 21.9680 101.9804 2.5579 324.0223 218.2905 39.8056 15.9509 23.8441 14.2069 28.5011 13.7472 47.5983 30.1263 3.7247 16.7244 66.8299 59.7066 17.9871 18.5961
temp: 298.150 k
press: 1.00000 atm
elementType: 7 7 6 6 6 6 6 6 6 6 6 6 6 6 6 1 1 1 1 1 1 1 1 1 1 1 1 1 1
symmnumber: 1
zpe: 625887.4 jmol-1
zpe.correction: 0.238388 hartree
zpe.thermalcorrener: 0.252205 hartree
zpe.thermalcorrenthalpy: 0.253149 hartree
zpe.thermalcorrgfe: 0.196709 hartree
zpe.sumelectzpe: -612.233267 hartree
zpe.sumelectthermal: -612.219450 hartree
zpe.sumelectthermalent: -612.218506 hartree
zpe.sumelectthermalfe: -612.274945 hartree
dipole: -0.2823 -0.4208 -1.3589
dipole: 1.4503
quadrupole: -54.2014 -84.9928 -85.9850
quadrupole: 5.5044 -8.3660 0.8134
quadrupole: 20.8583 -9.9330 -10.9253 5.5044 -8.3660 0.8134
hfenergy: -612.4716547 hartree
pointgroup: C01 [X(C13H14N2)]
dipole: -0.1669593 0.5398716 -0.079076 debye
polarizability: 221.5842158|31.8047693|122.7482965|12.8840629|0.0283666|124.3419098 unknown
InChI: InChI=1S/C13H14N2/c14-12-6-4-10(5-7-12)8-11-2-1-3-13(15)9-11/h1-7,9H,8,14-15H2
charge 0 multiplicity 1
29 atoms
N  4.6224 1.65957 0.535039
N  -5.044758 0.093052 -1.133328
C  0.141711 -0.372039 1.426642
C  1.360119 -0.18756 0.519253
C  -1.212932 -0.264363 0.729515
C  2.418698 0.656154 0.922088
C  -2.216028 -1.246583 0.917679
C  -1.526797 0.839894 -0.105118
C  1.459765 -0.885534 -0.713299
C  3.585464 0.817395 0.119541
C  -3.484169 -1.139912 0.308786
C  -2.7862 0.965085 -0.720571
C  -3.791601 -0.026391 -0.522563
C  2.613514 -0.731758 -1.512421
C  3.673936 0.10728 -1.111118
H  0.200578 0.372825 2.246485
H  0.204269 -1.366151 1.914084
H  2.342404 1.20128 1.873292
H  -2.003838 -2.116812 1.552417
H  -0.764466 1.608073 -0.283997
H  0.635863 -1.528362 -1.041153
H  -4.238543 -1.919672 0.474058
H  -2.998375 1.830543 -1.361457
H  2.691433 -1.272025 -2.463548
H  4.563544 0.218874 -1.743692
H  5.454458 1.778076 -0.034497
H  4.562411 2.165863 1.413031
H  -5.258511 0.885737 -1.730523
H  -5.760849 -0.61314 -0.994926
