program: Gaussian 09
title: 000146729
version: EM64L-G09RevD.01
frameworkgroup: C1[X(C21H30O2)]
method: RPBEPBE
basis: SDD
operation: Freq
keyword: #pfreq=noraman
keyword: PBEPBE/SDD
title: #p freq=noraman PBEPBE/SDD
converged: YES YES NO NO
title: Mulliken charges:
elementType: O O C C C C C C C C C C C C C C C C C C C C C H H H H H H H H H H H H H H H H H H H H H H H H H H H H H H
charge: -0.281501 -0.438521 -0.120302 -0.218329 0.323294 -0.525480 -0.586130 0.098408 0.176187 0.436846 -0.400951 -0.759612 -0.770938 0.431177 -0.601681 -0.571090 -0.837939 -0.643317 0.325666 -0.388125 -0.342029 -0.359779 -0.696118 0.247137 0.241319 0.225388 0.214766 0.225835 0.236381 0.210528 0.233046 0.212519 0.250598 0.211686 0.235584 0.229544 0.212966 0.222188 0.273326 0.223112 0.228375 0.218692 0.222940 0.205493 0.212500 0.188105 0.186556 0.196347 0.197758 0.350059 0.210065 0.217211 0.210238
chargesum: 0.00000
title: Mulliken charges with hydrogens summed into heavy atoms:
elementType: O O C C C C C C C C C C C C C C C C C C C C C
charge: -0.281501 -0.088463 0.126835 0.022989 0.323294 -0.085326 -0.123915 0.098408 0.176187 0.436846 -0.190423 -0.063449 -0.094124 0.431177 -0.166527 -0.297763 -0.167760 -0.420377 0.325666 0.029869 0.032632 0.034326 -0.058604
polarizability: 2.79295893e+02 8.28664396e+00 2.61558210e+02 -1.42214468e+00 -8.36341876e+00 1.58467223e+02
1716.lowfreq: -10.0028 -5.7448 -0.0009 -0.0005 -0.0005 3.5456 20.2459 29.7276 46.5663
frequency: 20.2186 29.6077 46.4599 63.2689 69.3707 89.4289 98.8410 108.1727 147.8476 157.6978 163.7669 176.4867 185.2128 201.5016 214.2198 223.6427 226.4132 236.8840 242.2922 264.1482 278.8210 291.3571 302.2012 331.3859 334.1892 344.4556 347.0315 370.4563 408.8471 423.3963 430.1858 462.5403 476.7100 488.1387 516.1729 529.4791 546.5943 576.2283 605.0518 620.7754 633.0111 677.3975 716.8327 724.2074 751.2311 758.0938 790.1599 791.3249 813.6897 816.7703 840.6865 857.9232 875.7934 890.8497 897.0791 925.6759 935.6828 951.7198 956.4886 975.1559 985.6036 988.8858 1002.1783 1006.1843 1025.4412 1044.4423 1048.8478 1057.3861 1074.8240 1076.2324 1090.9816 1109.2521 1111.1938 1124.8645 1133.7380 1153.4986 1165.6201 1178.9929 1180.9891 1194.8227 1199.2807 1229.6430 1231.8023 1238.9481 1257.7114 1259.8953 1279.2309 1285.4350 1289.9224 1293.3033 1296.2328 1301.6620 1308.7395 1315.4639 1337.7418 1345.5546 1350.4579 1353.1467 1357.4519 1376.4507 1379.4929 1388.6974 1393.4529 1395.2054 1430.0740 1455.4979 1456.2281 1461.7182 1462.8820 1465.1237 1466.8693 1469.6654 1472.1805 1474.2412 1476.6812 1478.2381 1480.2098 1486.3883 1486.6063 1498.9158 1591.3056 1623.9404 1697.1683 2929.9555 2946.1025 2948.8060 2954.6952 2960.6151 2965.6534 2968.8529 2971.1838 2972.0195 2977.6874 2988.6026 2989.3976 2992.9452 3008.2263 3014.6149 3025.0847 3030.2592 3047.1739 3052.0509 3067.9798 3071.3161 3076.1868 3084.3127 3091.1900 3094.2352 3096.1393 3097.5721 3100.4831 3184.4774 3583.2118
redmass: 3.5133 3.8522 1.6211 4.2383 3.2772 2.9989 2.9789 2.5994 2.2980 3.6386 1.9152 1.0640 1.5077 3.5695 2.8061 1.7282 1.1687 1.7893 2.3536 2.5182 2.8570 3.1190 3.1497 2.9950 2.9666 1.1452 3.6246 4.0220 3.1463 2.5844 2.7868 3.1299 3.4866 3.4106 4.8441 4.3982 3.4735 3.9446 3.7972 4.0217 4.1448 4.5551 3.4073 1.0726 1.4186 2.1090 1.6773 2.3290 2.7447 1.6714 1.2709 1.5842 2.5115 1.9672 1.9989 1.4616 2.0071 1.3863 1.8149 3.1111 1.6899 2.4472 2.1733 3.7189 1.6928 2.2090 2.4555 2.2071 2.1438 2.3437 1.8487 1.9422 2.1423 2.0139 1.9531 1.2678 2.0222 1.9599 1.6207 1.4751 1.5218 2.0489 1.5559 1.3825 1.7207 1.6455 1.5655 1.1410 1.1369 1.2217 1.4498 1.5870 1.5328 2.8787 1.5083 1.5365 1.8435 1.7411 1.6932 1.4971 2.5877 1.2151 1.2185 1.2391 3.8009 1.0751 1.0650 1.0589 1.0853 1.0677 1.0691 1.0718 1.0615 1.1195 1.0427 1.0762 2.9512 1.0603 1.0811 1.0957 7.6191 6.6774 6.4920 1.0802 1.0658 1.0590 1.0404 1.0682 1.0592 1.0777 1.0560 1.0423 1.0642 1.0977 1.0357 1.0360 1.0944 1.0997 1.0965 1.0994 1.0945 1.0952 1.1006 1.0993 1.0980 1.0987 1.1003 1.0993 1.0991 1.0912 1.0906 1.0926 1.0659
irintensity: 0.0389 0.0650 0.0224 0.2018 0.4900 0.6866 0.1510 0.7922 0.2878 0.1309 0.7847 0.5098 0.7501 0.7714 0.6463 1.4381 0.0727 0.6296 0.9312 2.7312 1.8176 2.3133 0.5620 6.2753 4.2254 119.1461 3.1936 4.8277 0.3863 0.8978 4.3354 5.4880 0.0512 2.2595 6.1942 2.1965 5.6365 2.5655 11.7973 1.0265 1.0906 3.9121 7.1825 11.0233 1.1025 0.7838 10.5879 3.9318 8.6436 20.6048 1.0633 37.6943 1.0388 2.9232 8.3107 0.5928 0.7729 23.8766 4.0772 10.7393 20.3502 75.8631 9.0280 38.5106 12.0420 15.4097 0.0841 10.2004 3.8508 3.5700 142.3891 75.6745 39.4273 38.3428 12.6005 4.8911 4.0239 35.2577 41.1532 0.2431 0.6382 22.8832 14.4844 0.5564 8.7107 17.5129 8.5398 2.4595 1.2976 2.2107 4.5073 3.7596 4.4144 20.1267 2.7125 0.4136 2.8590 1.0949 11.8444 27.3986 70.0731 11.1530 33.0009 14.0960 101.2952 13.6787 1.0355 6.7839 7.6926 1.1164 2.1808 2.2167 14.8840 5.1650 12.2013 0.1292 13.7184 12.0091 10.4208 14.5051 85.2479 176.5902 3.3801 9.9589 29.0777 12.2878 32.8016 11.4054 25.0705 44.2768 22.2635 32.4302 79.0211 1.4529 13.5056 23.1701 41.1525 2.5113 24.6160 26.2920 62.4291 39.6734 91.5606 55.2455 25.4344 11.9771 17.3133 30.1856 48.4653 43.0021 18.3314 0.5166 35.0755
temp: 298.150 k
press: 1.00000 atm
elementType: 8 8 6 6 6 6 6 6 6 6 6 6 6 6 6 6 6 6 6 6 6 6 6 1 1 1 1 1 1 1 1 1 1 1 1 1 1 1 1 1 1 1 1 1 1 1 1 1 1 1 1 1 1
symmnumber: 1
zpe: 1203282.6 jmol-1
zpe.correction: 0.458306 hartree
zpe.thermalcorrener: 0.482472 hartree
zpe.thermalcorrenthalpy: 0.483416 hartree
zpe.thermalcorrgfe: 0.405086 hartree
zpe.sumelectzpe: -966.916112 hartree
zpe.sumelectthermal: -966.891946 hartree
zpe.sumelectthermalent: -966.891002 hartree
zpe.sumelectthermalfe: -966.969333 hartree
dipole: 2.2641 -2.0386 1.4542
dipole: 3.3759
quadrupole: -134.8648 -138.8545 -143.0839
quadrupole: 14.4522 -3.7801 3.4747
quadrupole: 4.0696 0.0799 -4.1495 14.4522 -3.7801 3.4747
hfenergy: -967.3744183 hartree
pointgroup: C01 [X(C21H30O2)]
dipole: 1.0258506 0.6018883 -0.5911411 debye
polarizability: 275.389445|-11.1698256|265.1705994|-1.199078|-9.9921448|158.7612812 unknown
InChI: InChI=1S/C21H30O2/c1-5-6-7-8-15-12-16(22)13-19-20(15)17-11-14(2)9-10-18(17)21(3,4)23-19/h9,12-13,17-18,22H,5-8,10-11H2,1-4H3
charge 0 multiplicity 1
53 atoms
O  -3.089081 -0.215296 0.505878
O  -1.358936 -4.645934 0.79971
C  -1.755916 1.79999 0.160893
C  -0.488339 0.988052 -0.240524
C  -3.070063 1.093093 -0.246193
C  -1.621399 3.254002 -0.342238
C  0.6828 1.575187 0.601404
C  -0.681394 -0.523915 -0.064706
C  -1.948066 -1.027705 0.368309
C  0.773191 3.094836 0.490918
C  -0.268226 3.838697 0.02638
C  -3.193232 0.793004 -1.754989
C  -4.3172 1.81367 0.285208
C  0.345114 -1.483011 -0.327915
C  1.689606 -1.11981 -0.958681
C  -2.161133 -2.388166 0.671295
C  2.08963 3.716832 0.915089
C  0.126533 -2.855321 -0.04708
C  -1.10619 -3.295977 0.483383
C  2.90026 -1.253398 0.007061
C  4.232004 -0.809216 -0.63661
C  5.448582 -0.98525 0.300976
C  6.774998 -0.519916 -0.337553
H  -1.778688 1.833217 1.27138
H  -0.265713 1.208887 -1.308116
H  -2.418575 3.883357 0.100863
H  -1.769757 3.302411 -1.442707
H  1.65006 1.145944 0.28631
H  0.553491 1.274864 1.662998
H  -0.151915 4.927678 -0.071301
H  -4.137744 0.25702 -1.952563
H  -3.19869 1.729668 -2.340924
H  -2.360802 0.163872 -2.113279
H  -4.505667 2.746505 -0.274242
H  -5.198179 1.158024 0.174639
H  -4.202036 2.057419 1.356041
H  1.868272 -1.797378 -1.818616
H  1.667438 -0.098121 -1.378795
H  -3.141173 -2.727877 1.013459
H  2.331974 3.455888 1.964982
H  2.069343 4.817733 0.834493
H  2.929653 3.341529 0.296394
H  0.924696 -3.579284 -0.262244
H  2.98381 -2.307291 0.341178
H  2.712473 -0.659203 0.923329
H  4.402793 -1.385311 -1.570642
H  4.156885 0.256588 -0.941041
H  5.530832 -2.052222 0.592921
H  5.269716 -0.420524 1.238752
H  -0.557628 -5.197568 0.620664
H  6.73002 0.551984 -0.608384
H  7.627564 -0.658028 0.352594
H  6.992603 -1.08903 -1.261257
