program: Gaussian 09
title: 000146670
version: EM64L-G09RevD.01
frameworkgroup: C1[X(C19H20O5)]
method: RPBEPBE
basis: SDD
operation: Freq
keyword: #pfreq=noraman
keyword: PBEPBE/SDD
title: #p freq=noraman PBEPBE/SDD
converged: YES YES NO NO
title: Mulliken charges:
elementType: O O O O O C C C C C C C C C C C C C C C C C C C H H H H H H H H H H H H H H H H H H H H
charge: -0.273596 -0.423315 -0.272608 -0.268545 -0.285952 -0.102477 -0.357076 0.180510 0.334348 0.353437 -0.764285 0.140127 -0.734346 -0.498002 -0.516723 0.140675 0.169807 -0.351542 0.201679 -0.370913 -0.266014 -0.202999 -0.242311 -0.538317 0.263456 0.288969 0.254727 0.208030 0.231778 0.224794 0.245438 0.242211 0.270645 0.271321 0.353185 0.250821 0.237631 0.227005 0.233289 0.233441 0.224409 0.221367 0.222692 0.243228
chargesum: 0.00000
title: Mulliken charges with hydrogens summed into heavy atoms:
elementType: O O O O O C C C C C C C C C C C C C C C C C C C
charge: -0.273596 -0.070130 -0.272608 -0.268545 -0.285952 0.160978 -0.068107 0.180510 0.334348 0.353437 -0.069750 0.140127 -0.021903 -0.227357 -0.245402 0.140675 0.169807 -0.100721 0.201679 -0.133282 -0.039009 0.263731 -0.017902 0.148970
polarizability: 2.61107189e+02 1.54634966e-01 2.30736128e+02 8.68699345e+00 5.96728403e+00 1.71843364e+02
1716.lowfreq: -73.8788 -8.9175 0.0006 0.0007 0.0008 2.2605 6.3091 22.2360 30.7212
frequency: -73.8670 21.8447 30.6376 49.8617 68.6291 85.5477 95.9257 133.4495 142.8385 165.5626 173.7404 197.3365 211.9371 224.0219 237.9512 241.2130 261.8410 267.5563 279.0748 294.9801 300.1625 312.2657 342.1261 356.5542 378.1930 423.6081 437.2714 458.7266 465.7854 490.1775 511.8011 537.4964 548.1930 567.2141 574.3252 606.3401 646.6088 676.1283 680.3949 697.9511 704.1468 741.1626 751.0088 757.2436 770.1588 779.9026 815.6871 840.8778 846.5288 849.4208 856.5352 867.8486 883.2506 909.4825 937.2231 947.7288 976.9809 979.4035 990.1134 1007.3799 1028.0601 1045.2201 1058.3572 1065.7779 1081.9936 1090.4682 1106.0440 1112.9624 1118.6446 1130.5296 1147.5042 1153.2659 1157.5830 1173.8310 1179.1425 1195.1037 1221.0049 1227.7487 1259.9658 1274.1915 1275.7784 1311.2357 1331.1258 1334.9515 1353.3321 1362.7957 1386.5350 1390.4787 1394.2345 1401.5217 1417.8473 1432.0581 1444.6507 1460.8580 1467.1065 1469.1895 1471.1150 1473.2798 1479.4084 1484.0739 1486.8467 1488.7977 1593.8131 1605.1850 1623.0264 1628.7436 2959.6411 2987.6468 2990.2645 2994.0252 3005.0452 3008.1774 3048.0940 3080.3951 3080.8918 3087.5267 3103.7948 3104.1033 3121.7910 3123.7126 3133.8065 3153.9140 3167.3087 3167.6705 3192.0347 3555.4954
redmass: 2.3566 4.4879 4.3425 5.4401 4.6682 4.1689 3.3149 4.3223 4.6988 4.2882 3.6041 1.1987 2.4451 1.5055 1.8220 1.4493 3.9144 1.6014 3.1657 3.0066 3.8203 3.7599 5.8756 4.5704 3.7396 3.8387 3.9798 3.8822 4.0575 3.8831 3.6675 5.2217 5.1323 4.3139 4.6631 6.3944 7.6791 6.3678 8.4838 4.2372 4.5520 3.6263 5.6144 1.4209 4.8702 4.7405 3.2406 2.7700 1.5296 3.9393 2.1191 2.9717 1.5908 1.9035 1.5791 1.6588 1.3732 4.7237 8.5391 2.8435 2.7201 2.1529 1.6974 1.4578 2.2975 2.1145 2.3605 1.2593 1.0366 2.1558 1.5324 3.6153 2.0063 1.1622 2.0056 1.7897 1.3688 2.9257 1.6796 4.0643 1.8971 1.4460 1.3596 1.3771 2.0488 1.3171 1.4592 2.8528 1.3096 4.7160 6.7790 1.4657 1.6047 1.0621 1.0510 1.7928 1.4383 1.1711 1.0660 1.0658 1.7526 1.2876 6.9796 6.2633 10.1718 8.2786 1.0328 1.0652 1.0501 1.0381 1.0534 1.0832 1.1040 1.1186 1.0984 1.0992 1.1000 1.0997 1.0991 1.0868 1.0891 1.0933 1.0996 1.0925 1.0933 1.0651
irintensity: 12.8863 0.2307 0.4847 0.1824 1.8579 0.0870 6.1183 1.4305 1.0561 1.1363 0.4874 0.5552 7.1558 0.9093 14.6022 4.2273 5.2366 71.1802 5.0304 15.0812 14.9580 0.2610 12.1010 20.9578 8.1387 2.1990 20.4387 4.5222 2.2892 3.4376 15.2180 16.9969 1.9049 7.8815 7.0359 2.6919 0.3647 1.5679 0.3002 0.3966 9.9688 4.6114 8.1828 78.4555 5.3217 3.5942 4.5000 3.1376 24.5984 29.9719 38.6256 75.5741 34.1038 41.6428 13.1487 7.4873 5.4662 175.5276 38.1673 33.9179 52.7763 14.8685 19.3654 4.2244 156.6833 86.3148 121.6227 0.0599 0.0968 184.6979 4.0280 38.7987 18.9909 8.3314 1.7752 29.3300 1.8884 108.8866 32.5528 91.6612 35.5246 6.7534 6.6185 10.0067 32.3609 1.3344 35.3349 11.6967 22.6421 89.7258 8.9388 17.6716 6.1467 10.1688 8.9300 205.4119 90.0605 36.8786 6.7642 18.2152 14.9417 23.7291 7.7724 22.0361 13.8203 12.9521 74.6973 3.4009 18.8215 13.8037 148.4333 13.6366 42.3964 32.7633 38.6072 18.6307 18.8163 17.1420 20.9757 4.5475 9.8361 23.3362 22.5663 1.6833 0.3263 10.7321
temp: 298.150 k
press: 1.00000 atm
elementType: 8 8 8 8 8 6 6 6 6 6 6 6 6 6 6 6 6 6 6 6 6 6 6 6 1 1 1 1 1 1 1 1 1 1 1 1 1 1 1 1 1 1 1 1
symmnumber: 1
zpe: 914354.2 jmol-1
zpe.correction: 0.348259 hartree
zpe.thermalcorrener: 0.369704 hartree
zpe.thermalcorrenthalpy: 0.370649 hartree
zpe.thermalcorrgfe: 0.297992 hartree
zpe.sumelectzpe: -1110.345451 hartree
zpe.sumelectthermal: -1110.324006 hartree
zpe.sumelectthermalent: -1110.323061 hartree
zpe.sumelectthermalfe: -1110.395718 hartree
dipole: 2.0484 -1.2056 2.3334
dipole: 3.3308
quadrupole: -125.5728 -132.4648 -135.4989
quadrupole: -4.8803 6.6181 5.0231
quadrupole: 5.6060 -1.2860 -4.3201 -4.8803 6.6181 5.0231
hfenergy: -1110.6937099 hartree
pointgroup: C01 [X(C19H20O5)]
dipole: -0.7929884 0.4886696 0.9217248 debye
polarizability: 259.7763912|1.1696351|229.3428939|-12.9311276|-11.7384573|174.5673958 unknown
InChI: InChI=1S/C19H20O5/c1-11-18(12-6-4-5-7-14(12)21-3)13-8-16-17(23-10-22-16)9-15(13)24-19(11,2)20/h4-9,11,18,20H,10H2,1-3H3
charge 0 multiplicity 1
44 atoms
O  1.494891 -2.468949 -0.317743
O  -0.039005 -4.209707 -0.490744
O  3.057357 2.86629 0.24289
O  4.726778 1.2173 -0.292842
O  -2.831396 0.552501 1.800706
C  -0.94964 -2.002893 -0.260564
C  -0.70606 -0.569235 0.313625
C  0.170084 -2.961055 0.200085
C  0.756845 -0.140106 0.136128
C  -1.691587 0.42407 -0.308353
C  -2.352042 -2.540665 0.090463
C  1.768563 -1.095499 -0.155819
C  0.315899 -3.169172 1.716573
C  1.129951 1.228305 0.295105
C  3.13549 -0.73576 -0.327824
C  -2.765611 0.967306 0.45461
C  2.468527 1.57438 0.134486
C  -1.581858 0.809602 -1.664246
C  3.450856 0.611386 -0.177825
C  -3.693929 1.86525 -0.127818
C  -2.502154 1.700245 -2.260723
C  4.499809 2.668522 -0.045803
C  -3.559273 2.226163 -1.487108
C  -3.901059 1.102692 2.633977
H  -0.851964 -1.963552 -1.36397
H  -0.931285 -0.602943 1.397531
H  -2.463653 -3.578887 -0.263155
H  -2.53668 -2.511792 1.180222
H  -3.1269 -1.92097 -0.39323
H  1.152831 -3.862695 1.915702
H  0.533342 -2.220514 2.236006
H  -0.60827 -3.602489 2.134316
H  0.371973 1.984349 0.516241
H  3.88174 -1.497755 -0.559799
H  0.755199 -4.786098 -0.347746
H  -0.746581 0.41289 -2.253746
H  -4.516135 2.28369 0.460414
H  -2.392584 1.982368 -3.312974
H  4.767128 3.230896 -0.958078
H  5.090604 2.976151 0.834627
H  -4.279907 2.920171 -1.934108
H  -4.899616 0.822027 2.246186
H  -3.828748 2.205295 2.707824
H  -3.750629 0.654584 3.627403
