program: Gaussian 09
title: 000146650
version: EM64L-G09RevD.01
frameworkgroup: C1[X(C12H8N6O)]
method: RPBEPBE
basis: SDD
operation: Freq
keyword: #p
keyword: freq=noraman
keyword: PBEPBE/SDD
title: #p freq=noraman PBEPBE/SDD
converged: NO YES NO NO
title: Mulliken charges:
elementType: O N N N N N N C C C C C C C C C C C C H H H H H H H H
charge: -0.215267 -0.316505 -0.102101 -0.063478 0.013302 0.034510 -0.607401 0.251663 0.153716 -0.013730 -0.184364 0.145906 -0.282499 0.259317 -0.188031 -0.369183 -0.357511 -0.264386 -0.165615 0.270153 0.235601 0.279908 0.245620 0.350030 0.367122 0.258150 0.265074
chargesum: 0.00000
title: Mulliken charges with hydrogens summed into heavy atoms:
elementType: O N N N N N N C C C C C C C C C C C C
charge: -0.215267 -0.316505 -0.102101 -0.063478 0.013302 0.034510 0.109751 0.251663 0.153716 -0.013730 -0.184364 0.145906 -0.012346 0.259317 0.047570 -0.089276 -0.111892 -0.006236 0.099458
polarizability: 3.24248158e+02 -1.34659312e+01 1.99445657e+02 -2.03239495e-02 3.88716213e-03 6.70017180e+01
1716.lowfreq: -3.6886 -0.0008 -0.0003 0.0011 4.6648 8.2318 45.6959 57.5136 76.2676
frequency: 45.6242 57.5072 76.2672 102.7685 134.5454 183.7189 216.8143 238.2123 252.7945 310.7460 324.0270 369.8696 426.3083 469.1066 470.2519 489.7417 538.3932 543.0792 563.7870 574.0516 587.3198 629.9549 638.7928 659.5928 666.2582 700.1484 716.5072 736.4257 740.3545 788.6123 814.0233 832.0366 856.1243 869.3943 875.3585 892.2461 923.0100 947.9656 975.6152 985.4207 1001.9626 1040.6702 1046.1192 1060.4888 1089.9973 1107.4515 1147.3504 1168.1614 1185.3144 1202.9454 1232.2308 1252.9154 1273.9570 1300.1319 1334.2330 1368.1459 1381.9032 1388.6549 1426.5082 1438.9963 1490.8520 1513.0006 1524.2347 1568.6538 1602.3804 1629.8463 1651.9068 3128.4638 3152.9136 3176.6760 3226.7626 3246.7285 3270.8153 3531.9477 3695.8921
redmass: 4.9301 6.0935 5.4771 5.0779 6.2610 8.0661 6.4929 6.7002 4.0295 6.7316 5.2621 6.6033 6.2223 7.9693 4.2468 8.6104 1.4502 1.6773 1.3390 9.8379 3.0352 5.8468 6.2374 6.6889 8.6004 8.0783 8.9168 1.3360 6.4262 2.3889 2.0752 1.3339 4.7095 6.6958 5.7792 1.3809 7.0453 1.4016 6.8330 1.3784 1.7726 2.5488 2.6002 3.4241 2.0672 2.3204 2.2698 2.6215 2.8459 1.8613 2.9703 4.8893 6.6452 6.5725 2.8109 2.7409 2.5590 5.0677 5.4076 2.9678 4.7486 5.1684 4.8110 1.5908 7.4420 6.9291 5.4851 1.0899 1.0904 1.0999 1.0916 1.0996 1.1084 1.0454 1.1053
irintensity: 0.3113 0.3527 0.3915 12.4207 0.9645 0.5267 2.1528 1.9345 5.2638 0.0049 6.4860 0.6229 1.0076 2.6374 2.5943 0.1246 29.9085 205.6221 56.7850 2.0096 10.1749 7.4082 0.9749 2.7074 10.6745 3.8356 0.0934 71.4958 25.5081 57.3914 14.0481 27.2922 1.7139 15.9209 5.9269 0.8189 17.1661 0.0074 2.6091 0.6797 30.4737 5.4482 5.2969 5.2971 1.3229 37.9973 19.2981 2.3346 74.0854 7.2411 5.4578 10.8719 46.5328 15.8503 0.8596 0.9733 35.8098 75.8916 106.3647 83.9071 89.8838 183.2459 30.7389 82.6277 175.4667 90.9538 607.0865 23.5833 3.9246 20.1016 5.3098 0.4881 0.0045 156.1401 77.8093
temp: 298.150 k
press: 1.00000 atm
elementType: 8 7 7 7 7 7 7 6 6 6 6 6 6 6 6 6 6 6 6 1 1 1 1 1 1 1 1
symmnumber: 1
zpe: 502922.0 jmol-1
zpe.correction: 0.191553 hartree
zpe.thermalcorrener: 0.205373 hartree
zpe.thermalcorrenthalpy: 0.206317 hartree
zpe.thermalcorrgfe: 0.150155 hartree
zpe.sumelectzpe: -864.497546 hartree
zpe.sumelectthermal: -864.483725 hartree
zpe.sumelectthermalent: -864.482781 hartree
zpe.sumelectthermalfe: -864.538944 hartree
dipole: -2.8836 -0.9114 0.0002
dipole: 3.0242
quadrupole: -101.3340 -88.6611 -112.4428
quadrupole: -8.2247 -0.0014 0.0009
quadrupole: -0.5214 12.1515 -11.6301 -8.2247 -0.0014 0.0009
hfenergy: -864.6890986 hartree
pointgroup: C01 [X(C12H8N6O1)]
dipole: 1.1342091 -0.3595341 -0.0000923 debye
polarizability: 324.2708867|13.3601724|199.4229284|-0.0203272|-0.0038699|67.001718 unknown
InChI: InChI=1S/C12H8N6O/c13-12-16-9-7(3-1-5-14-9)11-15-10(17-18(11)12)8-4-2-6-19-8/h1-6H,13H2
charge 0 multiplicity 1
27 atoms
O  4.005688 0.688377 -0.000517
N  -0.204694 1.057144 -0.000163
N  0.664584 -1.011748 -0.000146
N  1.177382 1.280437 -0.000226
N  -2.48646 1.735736 -0.000032
N  -4.210497 0.130716 0.000129
N  -0.736161 3.340151 -0.000192
C  -0.499576 -0.314072 -0.000103
C  -1.887423 -0.690727 0.000004
C  1.649397 -0.013731 -0.000338
C  -2.857465 0.38896 0.000036
C  -1.195232 2.054478 -0.00013
C  -2.337784 -2.035953 0.000073
C  3.054529 -0.353264 -0.000448
C  -3.718448 -2.280756 0.000168
C  3.705398 -1.583274 -0.000473
C  -4.605322 -1.165245 0.000188
C  5.121715 -1.310026 -0.000557
C  5.266402 0.069382 -0.000609
H  -1.601799 -2.84623 0.000054
H  -4.118011 -3.29874 0.000223
H  3.210612 -2.55144 -0.00042
H  -5.690119 -1.325418 0.000271
H  -1.415654 4.096279 -0.000158
H  0.269083 3.512209 -0.000248
H  5.928427 -2.039873 -0.000601
H  6.11763 0.74413 -0.000685
