program: Gaussian 09
title: 000146643
version: EM64L-G09RevD.01
frameworkgroup: C1[X(C9H11N3O2)]
method: RPBEPBE
basis: SDD
operation: Freq
keyword: #p
keyword: freq=noraman
keyword: PBEPBE/SDD
title: #p freq=noraman PBEPBE/SDD
converged: YES YES NO NO
title: Mulliken charges:
elementType: O O N N N C C C C C C C C C H H H H H H H H H H H
charge: -0.454991 -0.454014 -0.098135 -0.007393 -0.054251 -0.323539 -0.076953 0.497727 -0.392721 -0.388836 -0.394120 -0.223343 -0.226333 -0.238028 0.252612 0.222744 0.237517 0.236744 0.246438 0.238923 0.365663 0.226419 0.227463 0.230055 0.350351
chargesum: 0.00000
title: Mulliken charges with hydrogens summed into heavy atoms:
elementType: O O N N N C C C C C C C C C
charge: -0.089328 -0.103662 -0.098135 -0.007393 -0.054251 -0.070928 0.145791 0.497727 0.081540 -0.142398 -0.155197 0.003077 0.001130 -0.007973
polarizability: 1.42838597e+02 -1.49791270e+00 1.23609081e+02 1.28252218e+00 6.89055954e+00 1.01282176e+02
1716.lowfreq: -12.2080 -6.9228 -0.0003 0.0004 0.0005 5.4298 26.0716 43.2193 55.5310
frequency: 25.7400 43.1912 55.5167 70.1395 100.1706 131.4849 196.3070 203.6417 251.5962 290.3432 308.7711 326.9405 385.6615 402.3365 431.7339 487.0855 499.4094 552.8420 558.5742 597.0129 615.5936 652.3249 703.3209 768.2626 807.4697 853.9610 866.8948 891.5969 924.5886 943.2163 978.8123 990.7946 997.6200 1020.6848 1025.5258 1056.5976 1073.9378 1083.1267 1146.5534 1173.6347 1187.2792 1202.7963 1236.9820 1253.8294 1266.0696 1276.0963 1298.4497 1321.7913 1334.3628 1357.1690 1386.5755 1395.4001 1442.6233 1449.0044 1481.8666 1595.4302 1613.4614 2043.8810 2941.0808 2984.3520 3023.5820 3102.1859 3120.8025 3128.3076 3139.0196 3150.0141 3165.5500 3476.0251 3569.3040
redmass: 4.0432 7.6096 5.0633 5.4571 4.8194 4.0267 5.9375 5.7482 4.8317 6.9849 1.1097 6.5271 6.1522 2.8115 2.7463 10.5131 4.0918 1.1650 4.0347 3.8714 6.3531 6.7689 1.7451 1.8513 4.7066 1.2575 2.4208 6.8745 1.4568 4.7237 1.4114 5.7428 1.3263 1.8681 2.2335 2.3468 3.8405 1.5792 1.4462 1.0568 1.1133 2.5298 1.3988 5.2394 1.2880 1.1956 1.2455 1.2974 1.2583 1.2024 6.5477 1.6230 2.1416 1.0822 2.2850 6.1094 6.1169 13.6789 1.0831 1.0848 1.0585 1.1076 1.0861 1.0869 1.0918 1.0964 1.1016 1.0647 1.0665
irintensity: 0.4367 0.7340 4.0917 0.5767 5.7888 2.3386 2.5212 3.7049 4.7553 18.5053 94.2337 1.6270 4.3761 0.2480 6.8650 4.1266 2.8292 168.8457 55.8490 19.5275 0.8414 34.0814 58.9823 33.5567 19.8175 0.1154 14.9626 20.9330 8.3944 99.4606 0.1499 0.8794 0.1028 25.4217 7.3269 14.8726 28.3905 6.6891 22.3505 0.1683 1.4889 6.0377 61.5923 59.9566 4.7698 30.1531 39.2959 12.3728 4.1124 8.9244 1.7946 19.2313 14.0829 7.3245 11.3370 1.4848 1.7844 345.8099 31.1443 32.0088 31.4689 20.1097 3.3386 0.0239 14.0776 35.2553 20.3275 40.4162 13.1014
temp: 298.150 k
press: 1.00000 atm
elementType: 8 8 7 7 7 6 6 6 6 6 6 6 6 6 1 1 1 1 1 1 1 1 1 1 1
symmnumber: 1
zpe: 505041.3 jmol-1
zpe.correction: 0.192360 hartree
zpe.thermalcorrener: 0.206003 hartree
zpe.thermalcorrenthalpy: 0.206947 hartree
zpe.thermalcorrgfe: 0.150255 hartree
zpe.sumelectzpe: -663.138180 hartree
zpe.sumelectthermal: -663.124537 hartree
zpe.sumelectthermalent: -663.123593 hartree
zpe.sumelectthermalfe: -663.180285 hartree
dipole: -0.5640 -1.1063 1.6695
dipole: 2.0807
quadrupole: -77.0295 -94.1696 -73.6095
quadrupole: -5.6175 -4.4679 0.5523
quadrupole: 4.5734 -12.5667 7.9933 -5.6175 -4.4679 0.5523
hfenergy: -663.3305401 hartree
pointgroup: C01 [X(C9H11N3O2)]
dipole: -0.1220458 -0.5016031 0.6353053 debye
dipolederiv: -0.4528156 0.0808053 -0.0674697 0.0115257 -0.7852135 -0.0932506 -0.1168835 -0.1190791 -0.4801271 -0.9457456 -0.1518392 0.1524136 -0.2287205 -0.6813372 0.142085 0.1638106 0.1428634 -0.1847605 -0.3862791 -0.5561048 -0.0070945 -0.0525069 -1.3022035 0.1464197 -0.0495337 0.3778256 -0.1886125 0.0933038 0.7412108 -0.0655198 0.3141584 1.488957 -0.3153119 0.0362387 -0.4709058 0.0862096 -0.1003802 -0.265759 0.0365296 -0.1559064 -0.8700954 0.1374022 0.001668 0.1288625 -0.1150545 0.3781524 -0.129571 0.071711 -0.1707659 0.8730579 0.0052652 0.149237 0.1029186 0.2707681 0.0787476 -0.0157263 0.0592671 0.2255611 0.5123543 0.1050946 0.0418421 0.0667843 0.3756945 0.1626613 -0.0218617 0.019532 -0.0310636 -0.2116182 0.0042274 -0.0419118 -0.0456991 -0.0479102 0.4888636 0.2384988 -0.0877463 0.1156184 0.4256374 -0.129617 -0.1009679 -0.1297542 0.2621151 -0.0997027 -0.0372766 -0.0515805 -0.0522812 -0.094422 0.0597256 -0.0219805 0.0521734 -0.0264863 -0.096171 0.0806761 0.0851118 0.0570214 -0.083309 0.0888135 0.026028 0.0835434 0.0242847 -0.0354834 0.0148927 0.0797004 0.0178058 -0.1143625 0.0727538 0.0922185 0.0647286 0.0781521 0.0050268 -0.0562414 -0.0856411 -0.0752219 -0.0839091 0.0907395 -0.0671682 0.0633483 0.0333918 0.0833054 -0.036795 0.0299831 -0.0499839 -0.1393856 0.0267026 0.0102896 0.032525 -0.0713244 0.0284121 0.0550303 -0.0190119 0.00089 -0.0623347 -0.0108961 -0.0591017 -0.0443617 -0.1081832 0.0090279 -0.0052357 -0.0509197 0.015663 -0.0066024 -0.0007241 -0.045364 -0.0127355 -0.1890875 0.0459651 -0.0056314 -0.0178972 -0.0266357 0.0481693 0.037456 -0.0548527 0.0811605 -0.0896115 0.049547 0.0497432 0.0405973 0.0234754 -0.0795799 -0.0582577 0.0597374 -0.1185806 0.0124658 0.0423829 0.0358657 0.0843758 0.0491621 0.0952529 -0.0685507 0.0780767 -0.0783818 0.0189521 0.0553261 -0.0180535 -0.0971136 -0.0042025 0.1169982 -0.0510749 -0.0797132 -0.0420104 -0.0209799 0.2697843 -0.1159556 0.0159468 -0.078856 0.29991 0.0230085 0.0705892 0.0459707 0.3110916 0.0346587 -0.0002795 -0.0809735 -0.0090967 0.1254198 -0.0698406 -0.0969729 -0.0591103 -0.0624453 0.012387 0.0681892 0.0737683 0.0700338 0.1035169 -0.0848361 0.084891 -0.0862271 -0.0163724 -0.1233535 0.0536436 -0.0342915 0.0482589 0.138419 -0.0175901 -0.0353616 -0.0173301 0.0952591 0.4023789 -0.0022249 -0.0836777 -0.013933 0.2866804 -0.0397441 -0.0448152 -0.0185285 0.0325705 unknown
polarizability: 142.7334114|2.1663346|122.8775323|-1.1334599|8.0914681|102.1189098 unknown
InChI: InChI=1S/C9H11N3O2/c10-12-11-9(8(14)6-13)7-4-2-1-3-5-7/h1-5,8-9,13-14H,6H2
charge 0 multiplicity 1
25 atoms
O  -1.254188 -2.182046 -0.548831
O  -3.803343 -1.953642 0.475853
N  -1.21058 1.425188 0.244908
N  -0.664672 2.519807 -0.081529
N  -0.276959 3.626883 -0.261991
C  -0.700708 0.147866 -0.386223
C  -1.562537 -0.980951 0.227911
C  0.794928 -0.073832 -0.172854
C  -3.078162 -0.703608 0.145784
C  1.41453 0.262421 1.057256
C  1.570722 -0.657606 -1.202263
C  2.792418 0.022504 1.250426
C  2.947833 -0.903693 -1.007521
C  3.563394 -0.561968 0.218588
H  -0.919032 0.160932 -1.474337
H  -1.270931 -1.123198 1.292763
H  -3.372738 -0.479582 -0.893009
H  -3.374332 0.131834 0.804333
H  0.820987 0.720702 1.857652
H  1.090421 -0.939274 -2.146098
H  -2.019783 -2.803763 -0.404781
H  3.264928 0.29158 2.201772
H  3.538543 -1.359927 -1.80952
H  4.632913 -0.74733 0.368371
H  -3.851151 -2.057597 1.45974
