program: Gaussian 09
title: 000146634
version: EM64L-G09RevD.01
frameworkgroup: C1[X(C16H18O3)]
method: RPBEPBE
basis: SDD
operation: Freq
keyword: #pfreq=noraman
keyword: PBEPBE/SDD
title: #p freq=noraman PBEPBE/SDD
converged: YES YES NO NO
title: Mulliken charges:
elementType: O O O C C C C C C C C C C C C C C C C H H H H H H H H H H H H H H H H H H
charge: -0.271444 -0.271396 -0.436009 -0.585141 -0.594110 0.593314 0.527005 -0.588875 -0.587996 0.369249 0.369184 -0.385697 -0.383899 -0.514793 -0.386685 -0.348190 0.277284 -0.536250 -0.536222 0.218487 0.219997 0.223391 0.224335 0.244002 0.244645 0.229972 0.231838 0.273464 0.216138 0.248323 0.219753 0.218245 0.244442 0.244428 0.217784 0.219460 0.351966
chargesum: 0.00000
title: Mulliken charges with hydrogens summed into heavy atoms:
elementType: O O O C C C C C C C C C C C C C C C C
charge: -0.271444 -0.271396 -0.084044 -0.146657 -0.146384 0.593314 0.527005 -0.344873 -0.343351 0.369249 0.369184 -0.155725 -0.152061 -0.241328 -0.170548 -0.099867 0.277284 0.146190 0.145450
polarizability: 2.52737004e+02 2.06485856e+00 2.16497631e+02 -1.60345695e+01 -1.21584622e-01 9.63116646e+01
1716.lowfreq: -7.0322 -0.0007 0.0004 0.0005 5.3886 9.6109 17.8184 21.2243 39.8209
frequency: 17.3150 20.7953 39.7906 43.1594 69.5092 88.7857 105.2917 156.7701 191.7477 197.6473 209.3302 210.3028 253.5278 263.5472 272.9056 297.6197 350.9173 353.2060 363.4867 370.2824 406.0249 411.6881 470.2686 471.9959 510.7964 546.9832 573.8369 574.0820 606.4347 628.2272 636.4683 691.8378 717.9433 765.7544 786.2882 806.0904 820.7002 836.3817 837.9437 847.2020 863.9213 867.9321 927.3212 950.0803 959.6167 976.2133 991.9291 999.7716 1004.3088 1016.8737 1043.5827 1097.6099 1112.0190 1112.1793 1131.9260 1140.9702 1145.2584 1159.0105 1161.4279 1170.8483 1178.5308 1216.8539 1245.8185 1263.5672 1266.6563 1278.1022 1306.1814 1319.2717 1324.6072 1390.4182 1396.8236 1424.1754 1425.1734 1442.6867 1458.1447 1460.8503 1465.3317 1465.5840 1473.3049 1473.4399 1481.7613 1487.9758 1503.8695 1594.7472 1597.6839 1619.3177 1626.5598 2955.1197 2955.7234 2985.7149 2994.4024 3033.0932 3040.3056 3040.9638 3060.3866 3107.5932 3121.3113 3123.4277 3123.8045 3133.0969 3147.5691 3151.5401 3168.9758 3185.4977 3581.1720
redmass: 3.9868 4.3296 3.3351 5.6977 2.9815 5.8153 3.5971 4.5575 1.5714 4.1426 2.3883 1.7912 2.4976 2.7394 1.7326 2.7594 4.3640 1.1114 2.9827 5.2615 3.1244 2.9641 6.0967 6.1495 3.0646 4.6064 3.6492 3.4744 4.6807 4.6872 6.7396 2.0052 3.4856 3.3275 1.2104 1.5109 2.2993 1.5356 1.4483 2.4312 1.8187 6.1543 1.4649 4.0603 1.4372 5.8317 1.7538 4.6951 2.9601 4.4458 2.1706 1.4041 1.2597 1.2600 1.9074 1.2387 1.2461 1.4732 1.6681 1.4374 1.1100 2.2355 2.8956 1.2585 1.3621 1.2395 3.9928 1.2721 1.5463 6.1993 7.0858 1.4489 2.7124 1.2122 2.0407 1.9591 1.0510 1.0507 1.1044 1.0526 1.4115 1.0999 2.7601 6.3820 6.4549 6.9160 6.4666 1.0333 1.0334 1.0592 1.0598 1.1012 1.1036 1.1036 1.1049 1.0871 1.0899 1.0988 1.0989 1.0963 1.0904 1.0913 1.0951 1.0926 1.0660
irintensity: 0.6988 0.4730 0.3134 0.0148 11.0469 1.4139 0.0012 1.2281 0.0003 2.4153 1.1901 0.9582 3.9566 0.9470 0.0094 3.1513 0.2347 144.4954 8.1482 1.7295 9.4376 2.6863 8.2863 0.2535 19.9574 14.8375 20.3216 9.3080 0.0410 0.9559 0.7492 22.0718 2.3408 15.7658 0.2945 26.1695 8.2472 59.2016 1.7851 0.2545 61.2012 2.3376 0.9798 13.8245 1.3434 1.0185 7.7064 0.7349 3.9191 4.1801 87.9314 30.9369 0.4307 0.0081 195.5172 123.7562 119.5720 0.0660 145.8641 4.5463 6.8592 2.3333 32.4414 4.2056 13.1047 3.6000 47.9003 8.7491 4.3165 16.3049 40.9877 39.1504 13.6718 4.5439 77.1930 22.7299 7.7253 18.4785 2.0024 52.7106 1.1881 12.3864 111.0408 139.7352 5.7333 256.4413 26.9269 87.5814 32.7653 0.4099 63.3831 0.0678 46.4989 57.1184 28.0344 21.6220 21.1114 28.5954 30.4422 14.9459 12.5709 3.1126 7.0885 0.1216 40.2367
temp: 298.150 k
press: 1.00000 atm
elementType: 8 8 8 6 6 6 6 6 6 6 6 6 6 6 6 6 6 6 6 1 1 1 1 1 1 1 1 1 1 1 1 1 1 1 1 1 1
symmnumber: 1
zpe: 788056.9 jmol-1
zpe.correction: 0.300155 hartree
zpe.thermalcorrener: 0.318789 hartree
zpe.thermalcorrenthalpy: 0.319733 hartree
zpe.thermalcorrgfe: 0.250761 hartree
zpe.sumelectzpe: -844.748155 hartree
zpe.sumelectthermal: -844.729521 hartree
zpe.sumelectthermalent: -844.728577 hartree
zpe.sumelectthermalfe: -844.797549 hartree
dipole: -2.1417 -1.5688 0.4064
dipole: 2.6857
quadrupole: -126.8189 -85.5813 -118.6089
quadrupole: 12.1414 -0.4819 -0.7856
quadrupole: -16.4825 24.7550 -8.2725 12.1414 -0.4819 -0.7856
hfenergy: -845.0483097 hartree
pointgroup: C01 [X(C16H18O3)]
dipole: -0.839187 -0.6206354 0.16461 debye
polarizability: 252.5456771|2.2070845|216.5152428|-16.8590801|-0.2532797|96.4853796 unknown
InChI: InChI=1S/C16H18O3/c1-18-15-9-13(10-16(11-15)19-2)4-3-12-5-7-14(17)8-6-12/h5-11,17H,3-4H2,1-2H3
charge 0 multiplicity 1
37 atoms
O  4.133209 2.387017 -0.150436
O  4.168245 -2.35751 -0.146334
O  -6.721426 0.054827 0.398568
C  -0.222308 -0.015994 0.663697
C  -1.045344 -0.018466 -0.667115
C  1.279408 -0.005854 0.4158
C  -2.545674 -0.021024 -0.420186
C  1.983033 -1.227159 0.279845
C  1.965107 1.225391 0.278008
C  3.356658 1.22512 0.001015
C  3.374513 -1.20678 0.002973
C  -3.263834 -1.235661 -0.286236
C  -3.266106 1.194137 -0.272295
C  4.06639 0.014149 -0.138472
C  -4.64983 -1.246804 -0.014233
C  -4.648843 1.205681 -0.000582
C  -5.340792 -0.020036 0.12998
C  3.457078 3.676752 -0.011947
C  3.511438 -3.656603 -0.004415
H  -0.509825 -0.907182 1.253661
H  -0.520964 0.869473 1.256671
H  -0.748236 -0.905283 -1.258654
H  -0.752762 0.870241 -1.258041
H  1.442872 -2.171796 0.397275
H  1.411251 2.162185 0.394102
H  -2.73508 -2.189855 -0.403088
H  -2.736721 2.14928 -0.378917
H  5.138629 0.02184 -0.347371
H  -5.186363 -2.200439 0.07914
H  -5.205034 2.141547 0.107549
H  3.017715 3.797995 0.997919
H  2.664321 3.803134 -0.775687
H  4.242808 4.430706 -0.166401
H  4.308222 -4.399275 -0.157004
H  2.720497 -3.79682 -0.767687
H  3.073995 -3.781717 1.005856
H  -7.114747 -0.850218 0.470041
