program: Gaussian 09
title: 000146675
version: EM64L-G09RevD.01
frameworkgroup: C1[X(C19H21N2)]
method: RPBEPBE
basis: SDD
operation: Freq
keyword: #p
keyword: freq=noraman
keyword: PBEPBE/SDD
title: #p freq=noraman PBEPBE/SDD
converged: NO YES NO NO
title: Mulliken charges:
elementType: N N C C C C C C C C C C C C C C C C C C C H H H H H H H H H H H H H H H H H H H H H
charge: -0.681027 -0.109775 -0.623284 0.207202 0.328732 0.165869 0.281837 0.069172 0.274979 0.114669 0.186884 -0.829970 -0.345759 -0.821119 -0.412042 -0.280288 -0.238506 -0.272735 -0.202536 -0.787947 -0.616034 0.303077 0.325602 0.324877 0.246908 0.261414 0.241306 0.234874 0.240473 0.234562 0.282894 0.231378 0.275222 0.270475 0.243809 0.243313 0.286841 0.264364 0.268298 0.277223 0.277397 0.257374
chargesum: 1.00000
title: Mulliken charges with hydrogens summed into heavy atoms:
elementType: N N C C C C C C C C C C C C C C C C C C C
charge: -0.030548 -0.109775 -0.320208 0.207202 0.328732 0.165869 0.281837 0.069172 0.274979 0.114669 0.186884 -0.080342 -0.110886 -0.063189 -0.180664 -0.005066 0.031969 -0.028927 0.040777 0.031556 0.195959
polarizability: 4.23491436e+02 -1.39192020e+00 2.28728333e+02 1.26919438e+00 1.18198990e+01 1.30180007e+02
1716.lowfreq: -8.4803 -0.0005 0.0000 0.0005 2.5619 3.8559 40.4669 48.4543 65.8692
frequency: 40.4523 48.4492 65.8552 88.4544 102.6316 125.3695 173.1812 178.6526 193.9381 202.4855 223.3541 226.4445 263.3668 272.9215 285.8520 291.9228 307.8502 345.2872 359.5403 363.3278 400.6608 421.6794 429.7975 446.2013 450.1458 463.2483 472.2893 491.4960 517.8765 540.3803 555.5877 576.4274 596.3077 614.5680 615.1379 670.5294 682.0083 718.7978 743.9632 761.4791 769.8918 777.7670 818.6424 826.1341 858.8782 883.7509 912.7535 934.0240 949.1672 956.2011 965.0319 984.8868 1009.4034 1022.0101 1023.8016 1030.6470 1037.8122 1048.3664 1049.4055 1067.5351 1105.5232 1114.6914 1135.8146 1154.3635 1179.8108 1180.2142 1204.1714 1246.8997 1256.6544 1267.7432 1285.3442 1320.3234 1356.3807 1358.7034 1382.0488 1386.6303 1400.4371 1403.5114 1408.0504 1410.5809 1415.4197 1445.3907 1451.8468 1452.3931 1467.1236 1470.8300 1476.0584 1478.2286 1482.9533 1492.6239 1495.5997 1508.8448 1513.9677 1533.6508 1572.5215 1579.6110 1615.8649 1625.3095 1643.6326 2983.2853 2989.0362 2998.3324 3019.8087 3059.4647 3068.4876 3079.8354 3102.6311 3104.6294 3122.1982 3127.8469 3130.9983 3146.2876 3148.7220 3153.4014 3164.8260 3174.8942 3189.6951 3211.9575 3550.1291 3687.7090
redmass: 4.1250 3.9522 4.0897 3.1724 3.2285 3.0661 1.2450 2.1281 1.2585 2.9517 3.4767 1.3838 3.2396 2.7798 3.1624 3.4504 1.1753 2.3413 3.5961 3.1171 1.2804 2.7379 2.4363 1.2413 3.6900 4.5645 3.3734 3.2599 4.1951 4.2156 4.1561 4.5547 3.8150 4.6123 3.4794 4.9478 3.8985 4.7057 4.0478 1.3985 3.9003 3.1761 1.6031 4.9908 1.4519 3.9453 3.5307 1.3617 1.3662 1.3415 2.2709 1.3287 1.7614 1.4843 1.5037 1.5522 1.5526 1.9106 1.5477 1.6731 3.1349 1.4214 1.7963 2.2830 1.1624 2.0050 2.0849 2.1894 1.6702 1.9998 2.9716 1.8237 3.4501 4.8493 5.0713 6.7818 1.4724 1.6495 1.2997 1.2294 2.1254 1.2458 1.2188 2.3918 1.1925 1.1985 1.0612 1.2238 1.1468 1.6641 1.4044 1.5067 1.7022 4.1169 6.3235 5.5385 5.0317 5.8846 1.2092 1.0393 1.0409 1.0460 1.0361 1.0977 1.0933 1.0940 1.0975 1.0991 1.1004 1.0876 1.0896 1.1035 1.0923 1.0932 1.0932 1.1002 1.0889 1.1001 1.0455 1.1034
irintensity: 1.9152 0.2366 0.3798 1.1423 1.4056 0.9807 2.2834 1.4128 0.0987 2.5358 1.2523 1.0825 1.2009 3.8374 6.8426 3.0382 2.2415 1.0625 5.8509 5.6390 62.0320 4.6920 22.6147 157.4950 1.8740 1.3952 5.8220 5.4053 6.3146 1.5992 1.2512 3.5610 1.8659 13.1626 1.3347 3.3739 1.6083 3.7594 2.5198 88.4037 5.5295 5.4030 38.5202 5.6138 3.8490 2.1554 0.6448 9.7304 1.0727 1.3878 13.2294 0.9220 2.8162 7.2530 1.8453 5.2113 2.7255 4.2034 5.2484 4.2615 19.7753 1.4686 3.6310 23.1326 19.5044 4.9949 3.3232 17.6943 1.2437 17.1359 15.6495 23.9935 10.8777 44.0109 143.5147 1.1794 14.6958 11.3946 45.7219 43.2318 51.1340 13.7291 9.7123 24.7738 6.8949 19.8397 18.8633 6.8816 75.6153 83.8167 37.8453 39.9508 24.2603 13.0163 67.3105 26.4393 48.2739 27.8800 160.1995 13.4126 14.7211 3.7366 9.5220 9.7403 7.9094 8.7860 6.3469 6.3159 5.3001 9.0581 1.5597 2.3500 2.0753 16.3414 0.7334 17.9855 0.8559 0.0738 79.5066 35.8568
temp: 298.150 k
press: 1.00000 atm
elementType: 7 7 6 6 6 6 6 6 6 6 6 6 6 6 6 6 6 6 6 6 6 1 1 1 1 1 1 1 1 1 1 1 1 1 1 1 1 1 1 1 1 1
symmnumber: 1
zpe: 925598.4 jmol-1
zpe.correction: 0.352542 hartree
zpe.thermalcorrener: 0.371911 hartree
zpe.thermalcorrenthalpy: 0.372855 hartree
zpe.thermalcorrgfe: 0.306295 hartree
zpe.sumelectzpe: -844.436862 hartree
zpe.sumelectthermal: -844.417493 hartree
zpe.sumelectthermalent: -844.416549 hartree
zpe.sumelectthermalfe: -844.483109 hartree
dipole: -8.7369 -0.2183 1.5622
dipole: 8.8781
quadrupole: -41.8446 -92.2721 -118.7551
quadrupole: 11.0577 4.0267 4.4944
quadrupole: 42.4460 -7.9815 -34.4645 11.0577 4.0267 4.4944
hfenergy: -844.7894038 hartree
pointgroup: C01 [X(C19H21N2)]
dipole: -3.4596408 0.0517926 -0.4782907 debye
polarizability: 422.8963277|1.0838524|229.866247|-13.3456752|5.0415626|129.6372014 unknown
InChI: InChI=1S/C19H21N2/c1-12-11-17(16-7-5-6-8-18(16)20)13(2)19-14(3)21(4)10-9-15(12)19/h5-11H,20H2,1-4H3
charge 1 multiplicity 1
42 atoms
N  2.897624 -1.587312 -1.561205
N  -3.983992 0.530896 0.015461
C  0.603611 -1.561613 0.48089
C  0.870674 -0.209543 0.080771
C  -0.685463 -2.087234 0.588852
C  2.299869 0.214248 0.021258
C  3.272455 -0.527613 -0.734798
C  -0.201352 0.681384 -0.199094
C  -1.786545 -1.195863 0.35445
C  -1.558483 0.2147 0.034599
C  -2.715947 1.081625 -0.013703
C  -0.901072 -3.541552 0.960452
C  2.740927 1.317771 0.803856
C  0.12809 2.00664 -0.87375
C  4.646878 -0.156369 -0.649112
C  -3.131171 -1.677435 0.420363
C  -4.198105 -0.831603 0.207357
C  4.097673 1.677559 0.880744
C  5.052371 0.925374 0.148939
C  -2.656781 2.592761 0.022938
C  -5.199304 1.39157 -0.108597
H  1.462763 -2.203857 0.702136
H  1.923499 -1.764461 -1.790914
H  3.606169 -2.093573 -2.087363
H  -1.491139 -3.650209 1.889355
H  0.064018 -4.046009 1.124692
H  -1.431426 -4.097584 0.164438
H  2.002789 1.869324 1.397763
H  0.283007 2.84543 -0.170049
H  -0.647189 2.305469 -1.596919
H  1.079219 1.900965 -1.421567
H  5.389566 -0.721648 -1.22449
H  -3.331453 -2.731002 0.622025
H  -5.235532 -1.166763 0.206104
H  4.41351 2.514686 1.509852
H  6.114161 1.188575 0.200335
H  -1.702166 2.932132 0.438507
H  -3.455609 3.001612 0.663637
H  -2.768345 3.051915 -0.977495
H  -5.057266 2.150593 -0.8908
H  -5.424987 1.887741 0.850463
H  -6.051646 0.756376 -0.389178
