program: Gaussian 09
title: 000146635
version: EM64L-G09RevD.01
frameworkgroup: C1[X(C13H15ClN2O2)]
method: RPBEPBE
basis: SDD
operation: Freq
keyword: #p
keyword: freq=noraman
keyword: PBEPBE/SDD
title: #p freq=noraman PBEPBE/SDD
converged: YES YES NO NO
title: Mulliken charges:
elementType: Cl O O N N C C C C C C C C C C C C C H H H H H H H H H H H H H H H
charge: -0.067036 -0.248480 -0.307219 -0.173650 -0.413272 -0.101223 -0.466771 -0.454220 -0.352313 -0.150824 0.184565 0.095849 0.423024 -0.317194 -0.419448 -0.508424 -0.289484 -0.071553 0.263685 0.224395 0.242464 0.226397 0.220136 0.238583 0.260346 0.221123 0.299736 0.282596 0.237085 0.243149 0.194587 0.224793 0.258600
chargesum: 0.00000
title: Mulliken charges with hydrogens summed into heavy atoms:
elementType: Cl O O N N C C C C C C C C C C C C C
charge: -0.067036 -0.248480 -0.307219 -0.173650 -0.113536 0.162461 0.000088 -0.007687 0.146615 0.070299 0.184565 0.095849 0.423024 -0.034598 -0.182363 0.154104 -0.030884 -0.071553
polarizability: 2.41370314e+02 -2.55730137e+00 1.63560984e+02 -8.15719314e-01 -1.56954185e+01 1.09651184e+02
1716.lowfreq: -1.8534 -0.0025 -0.0010 -0.0006 8.9531 13.5657 40.6912 50.5703 75.4160
frequency: 40.5545 50.5299 75.3845 98.5911 105.5322 138.9166 159.1229 169.2257 201.1205 223.5509 243.2535 261.2707 282.3462 292.1124 336.0228 359.4097 378.5379 426.5095 446.8495 465.3071 489.1481 530.8620 562.0586 573.4396 595.3734 631.6355 666.2429 676.2907 691.3256 749.2969 756.2810 819.8317 841.8307 844.8079 866.3077 870.2336 883.8858 916.9834 939.0236 962.3630 976.6901 1010.5159 1027.5646 1059.1126 1087.1971 1091.2574 1110.9086 1115.1295 1124.2536 1139.6734 1143.2558 1180.5207 1186.1831 1197.5515 1241.0500 1250.7226 1259.2672 1279.3437 1301.8104 1310.8398 1321.2946 1329.7804 1334.9642 1345.7810 1367.8826 1402.8876 1406.5026 1429.3809 1456.8673 1465.0529 1473.5482 1475.1092 1478.5597 1490.8261 1505.9065 1542.1693 1579.7283 1611.5913 2931.0452 2935.1769 2978.3754 2994.3135 3011.1371 3016.8016 3024.4158 3076.8237 3084.3497 3094.7803 3112.6781 3137.7467 3158.8089 3184.5982 3553.3498
redmass: 4.7984 4.8095 3.7926 2.8500 4.2220 2.6020 7.2397 2.9662 1.6597 2.4386 4.2662 6.2094 3.4600 5.5857 4.4996 5.8628 5.9610 5.9391 3.1416 1.1926 6.8368 6.6908 3.0764 3.3762 3.8959 4.7696 5.9023 4.6762 3.5790 3.5083 4.0203 1.5690 3.8320 1.6829 2.6712 2.7667 2.6044 1.9671 2.4070 2.4151 1.3531 4.1151 4.0675 2.0293 2.6843 2.6144 1.4089 1.8726 1.6587 1.4433 1.4869 1.8260 1.8396 2.2944 1.5284 1.3757 2.1366 1.3141 1.4865 1.3311 1.4951 1.3569 1.5908 1.5462 2.1550 5.6911 4.0204 1.1561 1.0535 1.0899 1.2968 1.6190 1.2134 1.0939 1.9309 7.7004 4.6243 7.3434 1.0544 1.0664 1.0853 1.0674 1.0611 1.0623 1.0975 1.1009 1.0993 1.1046 1.0981 1.0917 1.0888 1.0964 1.0767
irintensity: 0.1746 0.4178 0.8263 5.5145 4.5717 1.3777 1.4630 1.0325 7.4618 1.1570 0.4573 2.1934 1.7991 2.5600 2.9218 12.4587 0.6972 1.7764 1.6145 69.9461 31.1909 1.0776 2.4013 1.5472 7.3250 7.5067 12.9825 23.9011 7.0230 7.8109 28.4873 24.9382 40.9999 47.8138 16.8996 8.9679 25.9154 2.8963 5.1247 2.6354 1.1455 64.1782 147.4832 15.8391 58.2035 33.6882 3.8416 2.3930 14.6771 31.4659 33.6738 17.0896 11.5452 8.2671 11.1016 6.6230 27.3358 2.6473 22.8157 3.7030 19.2991 3.1362 85.3973 35.8803 14.2038 209.4732 8.3024 21.5326 6.5801 3.2359 35.5466 89.0077 18.9897 6.9475 52.4108 215.2180 83.4330 260.5946 43.6577 101.6567 30.7824 27.4951 32.9595 33.1240 53.4497 28.4413 10.0357 42.9070 20.5078 5.5002 2.2177 2.2666 18.4523
temp: 298.150 k
press: 1.00000 atm
elementType: 17 8 8 7 7 6 6 6 6 6 6 6 6 6 6 6 6 6 1 1 1 1 1 1 1 1 1 1 1 1 1 1 1
symmnumber: 1
zpe: 688011.0 jmol-1
zpe.correction: 0.262050 hartree
zpe.thermalcorrener: 0.278223 hartree
zpe.thermalcorrenthalpy: 0.279167 hartree
zpe.thermalcorrgfe: 0.218073 hartree
zpe.sumelectzpe: -1223.066333 hartree
zpe.sumelectthermal: -1223.050160 hartree
zpe.sumelectthermalent: -1223.049216 hartree
zpe.sumelectthermalfe: -1223.110310 hartree
dipole: -3.2670 5.1634 -2.9126
dipole: 6.7688
quadrupole: -113.8007 -104.8554 -114.6742
quadrupole: -4.3574 5.7149 4.6746
quadrupole: -2.6906 6.2547 -3.5641 -4.3574 5.7149 4.6746
hfenergy: -1223.3283826 hartree
pointgroup: C01 [X(C13H15Cl1N2O2)]
dipole: 1.3626449 1.9963024 1.1179583 debye
polarizability: 241.3051966|1.3256942|163.3055673|-4.3109546|15.9834314|109.9717172 unknown
InChI: InChI=1S/C13H15ClN2O2/c1-18-12-11-3-2-6-16(11)13(17)9-5-4-8(14)7-10(9)15-12/h4-5,7,11-12,15H,2-3,6H2,1H3
charge 0 multiplicity 1
33 atoms
Cl -5.303079 0.530908 0.609001
O  1.727245 1.658863 -0.966628
O  0.509584 -2.357126 -1.287013
N  1.613192 -0.876411 0.084782
N  -0.268148 1.636014 0.478077
C  1.748006 0.272934 1.003708
C  3.279418 0.373054 1.254498
C  3.818876 -1.041332 0.927299
C  2.923077 -1.493044 -0.244927
C  1.175618 1.577397 0.39769
C  0.457027 -1.350314 -0.499322
C  -0.884717 -0.741844 -0.150428
C  -1.192137 0.596825 0.268598
C  -1.971175 -1.643849 -0.343235
C  -2.559902 0.953083 0.490461
C  1.357496 2.889186 -1.670585
C  -3.314184 -1.301841 -0.11943
C  -3.5782 0.016528 0.302462
H  1.199359 0.079466 1.947566
H  3.503316 0.697202 2.28506
H  3.707754 1.108345 0.550396
H  4.888507 -1.033835 0.658394
H  3.683765 -1.719319 1.789865
H  3.287443 -1.107426 -1.216953
H  2.804127 -2.584383 -0.334994
H  1.554742 2.446794 0.982267
H  -0.677119 2.542596 0.704227
H  -1.710641 -2.64259 -0.706862
H  -2.809722 1.97086 0.810515
H  1.89247 2.85454 -2.631836
H  1.671896 3.793603 -1.105189
H  0.267364 2.935097 -1.86038
H  -4.120759 -2.022677 -0.271185
