program: Gaussian 09
title: 000146633
version: EM64L-G09RevD.01
frameworkgroup: C1[X(C16H18O4)]
method: RPBEPBE
basis: SDD
operation: Freq
keyword: #pfreq=noraman
keyword: PBEPBE/SDD
title: #p freq=noraman PBEPBE/SDD
converged: YES YES NO NO
title: Mulliken charges:
elementType: O O O O C C C C C C C C C C C C C C C C H H H H H H H H H H H H H H H H H H
charge: -0.271614 -0.271754 -0.440040 -0.488847 -0.588418 -0.589177 0.592048 0.578078 -0.584184 -0.592121 -0.514030 -0.429686 0.369255 0.368053 -0.514701 0.180224 -0.334823 0.126795 -0.536141 -0.536230 0.223034 0.218858 0.225028 0.222737 0.245489 0.244216 0.254851 0.232270 0.273155 0.217726 0.383208 0.219596 0.217767 0.244121 0.244103 0.219171 0.220143 0.371843
chargesum: 0.00000
title: Mulliken charges with hydrogens summed into heavy atoms:
elementType: O O O O C C C C C C C C C C C C C C C C
charge: -0.271614 -0.271754 -0.056832 -0.117004 -0.146526 -0.141412 0.592048 0.578078 -0.338696 -0.347906 -0.259179 -0.197416 0.369255 0.368053 -0.241546 0.180224 -0.117097 0.126795 0.145343 0.147187
polarizability: 2.59239122e+02 -2.19422810e+00 2.24078246e+02 1.61831375e+01 -1.42447795e+00 9.84825535e+01
1716.lowfreq: -1.5602 -0.0008 -0.0004 0.0008 5.9834 9.9085 15.1669 23.3721 41.3140
frequency: 14.5798 23.2757 41.1632 43.5812 71.1409 87.8425 106.2880 153.6500 188.1265 190.5923 208.9576 209.5325 230.1434 254.5213 259.4714 272.5685 275.7042 277.0831 292.3271 351.1566 364.6832 371.5368 434.5689 444.1806 472.6012 489.1672 499.9355 536.6680 559.9192 568.1962 574.4683 606.8596 615.7215 642.6634 691.6576 712.8246 745.5818 764.4074 786.1988 793.6006 837.5201 840.8422 863.7274 867.6619 879.2171 909.3387 934.5404 951.2747 976.1592 997.5080 1000.6737 1016.5592 1044.6066 1071.7516 1111.7743 1112.7043 1128.7498 1133.6536 1146.7301 1152.1776 1158.8902 1161.3749 1169.7884 1180.5118 1239.6801 1262.3807 1263.2314 1275.2524 1277.9438 1305.5584 1316.7820 1323.9213 1396.8492 1405.4095 1424.1153 1442.7140 1457.6655 1461.2019 1464.8409 1466.3007 1467.2052 1473.1300 1473.4834 1482.0856 1487.9589 1503.2523 1595.0488 1609.8701 1619.2277 1631.2686 2955.9514 2957.7110 2986.3845 2995.1535 3033.8338 3042.3829 3044.2285 3061.1412 3115.0498 3121.2050 3122.4758 3142.0757 3148.0191 3149.9628 3152.0602 3184.7017 3526.5457 3623.9829
redmass: 5.0451 4.8962 3.9503 4.8664 3.0078 5.7110 3.5823 5.0072 3.2907 1.7188 2.2212 2.1469 3.2521 2.1292 1.2202 2.6306 1.9471 4.0133 3.0348 4.4159 3.0553 5.2776 3.5308 3.6191 6.1581 1.1083 5.2417 4.7908 4.9757 5.4143 3.5010 4.7241 4.0932 4.8755 2.0805 3.7637 3.7554 3.4935 1.3068 1.4681 1.6171 1.4827 1.7724 6.0912 1.5244 1.3504 3.6308 4.9392 5.8801 2.4181 3.0980 4.3986 2.1852 2.1456 1.2591 1.2592 1.4579 1.5205 1.1587 1.7730 1.4995 1.6418 1.4149 1.4029 1.8405 1.3257 1.3873 2.2993 1.3116 3.5615 1.5400 1.5939 7.2037 5.5183 1.4255 1.2118 2.0301 1.8980 1.0514 3.0890 1.0528 1.0626 1.0942 1.4472 1.1021 3.3620 6.4064 7.0436 6.9107 6.7620 1.0331 1.0330 1.0592 1.0598 1.1012 1.1038 1.1038 1.1049 1.0878 1.0991 1.0992 1.0953 1.0902 1.0927 1.0911 1.0926 1.0648 1.0666
irintensity: 1.4521 0.2657 0.7118 0.3077 9.8559 2.6941 0.0064 1.0063 2.4294 0.4009 2.6135 1.8478 14.5208 27.5323 131.4909 8.1337 1.8217 4.1544 4.3619 0.1509 9.1653 1.2261 10.9587 10.1628 0.2981 131.1149 17.9916 3.5341 16.0205 2.9362 9.2510 0.0710 6.7308 6.3473 21.4774 2.5881 5.0109 33.6599 10.8352 35.9547 12.5892 4.2894 56.7864 2.2399 24.9201 0.9297 24.3915 13.3568 1.0754 15.5488 15.6251 5.2025 78.5507 173.2637 0.2532 0.1934 98.5171 104.0385 6.9215 86.0127 10.8576 121.9804 7.4465 70.2892 58.3801 53.9473 38.2245 87.5840 9.0328 65.3389 25.4965 2.7002 43.4373 1.7788 40.8000 4.8770 74.9701 23.0557 12.4081 7.4578 13.8791 43.8998 10.2623 1.0157 12.3188 146.5250 138.0958 45.6261 251.9592 1.4779 70.0705 49.8627 0.9169 60.7522 0.1458 49.8594 52.6769 28.5438 18.9479 29.4937 29.9868 16.1062 12.8922 1.6934 2.8949 0.1403 85.1098 59.9770
temp: 298.150 k
press: 1.00000 atm
elementType: 8 8 8 8 6 6 6 6 6 6 6 6 6 6 6 6 6 6 6 6 1 1 1 1 1 1 1 1 1 1 1 1 1 1 1 1 1 1
symmnumber: 1
zpe: 797694.6 jmol-1
zpe.correction: 0.303826 hartree
zpe.thermalcorrener: 0.323688 hartree
zpe.thermalcorrenthalpy: 0.324632 hartree
zpe.thermalcorrgfe: 0.253340 hartree
zpe.sumelectzpe: -919.890999 hartree
zpe.sumelectthermal: -919.871138 hartree
zpe.sumelectthermalent: -919.870193 hartree
zpe.sumelectthermalfe: -919.941486 hartree
dipole: -3.4709 -2.8448 -0.4627
dipole: 4.5115
quadrupole: -117.3147 -94.6864 -123.7801
quadrupole: 13.4777 1.2133 0.6852
quadrupole: -5.3876 17.2406 -11.8530 13.4777 1.2133 0.6852
hfenergy: -920.1948252 hartree
pointgroup: C01 [X(C16H18O4)]
dipole: -1.3744677 1.1068864 0.190231 debye
polarizability: 258.9577754|2.4821855|224.1169294|-17.3132647|-1.7684734|98.7252173 unknown
InChI: InChI=1S/C16H18O4/c1-19-13-7-12(8-14(10-13)20-2)4-3-11-5-6-15(17)16(18)9-11/h5-10,17-18H,3-4H2,1-2H3
charge 0 multiplicity 1
38 atoms
O  4.566393 2.247936 -0.087379
O  4.262046 -2.48672 -0.188809
O  -5.139213 -2.022145 0.290062
O  -6.435965 0.342287 0.375488
C  0.044614 0.142126 0.647855
C  -0.771704 0.165341 -0.686982
C  1.544867 0.053085 0.40751
C  -2.270825 0.250181 -0.445057
C  2.160549 -1.212527 0.249798
C  2.317301 1.235099 0.300682
C  -3.025837 -0.927961 -0.207558
C  -2.93075 1.50416 -0.408434
C  3.707701 1.141079 0.032918
C  3.551714 -1.285863 -0.018304
C  4.329914 -0.11426 -0.128336
C  -4.403694 -0.853715 0.062197
C  -4.318001 1.589756 -0.13811
C  -5.047893 0.411752 0.097364
C  3.982727 3.578731 0.082085
C  3.511025 -3.738453 -0.084175
H  -0.300448 -0.718291 1.252475
H  -0.200385 1.055358 1.222839
H  -0.522696 -0.746287 -1.262677
H  -0.429456 1.026978 -1.290856
H  1.552718 -2.117814 0.34465
H  1.829053 2.205728 0.433384
H  -2.554101 -1.916061 -0.23631
H  -2.361956 2.42145 -0.598159
H  5.401649 -0.178803 -0.330193
H  -4.819483 2.565857 -0.117369
H  -6.086959 -1.774072 0.455658
H  3.544838 3.703188 1.092007
H  3.208427 3.782118 -0.683726
H  4.821625 4.278755 -0.04594
H  4.253304 -4.53325 -0.249748
H  2.719713 -3.801605 -0.856797
H  3.057604 -3.855911 0.919609
H  -6.853617 1.235874 0.390239
