program: Gaussian 09
title: 000146662
version: EM64L-G09RevD.01
frameworkgroup: C1[X(C19H20O6)]
method: RPBEPBE
basis: SDD
operation: Freq
keyword: #pfreq=noraman
keyword: PBEPBE/SDD
title: #p freq=noraman PBEPBE/SDD
converged: NO YES NO NO
title: Mulliken charges:
elementType: O O O O O O C C C C C C C C C C C C C C C C C C C H H H H H H H H H H H H H H H H H H H H
charge: -0.256503 -0.420268 -0.268416 -0.263732 -0.443632 -0.335150 -0.115605 -0.357859 0.234229 0.318109 0.406809 -0.753174 0.138475 -0.763170 -0.495408 -0.513330 -0.083207 0.170820 -0.381301 0.204611 0.225133 -0.249742 -0.369471 -0.206976 -0.521659 0.247864 0.278116 0.222450 0.232247 0.237204 0.220409 0.250783 0.235338 0.269574 0.275340 0.361078 0.249291 0.224359 0.242881 0.239322 0.228862 0.385774 0.227458 0.228127 0.243938
chargesum: 0.00000
title: Mulliken charges with hydrogens summed into heavy atoms:
elementType: O O O O O O C C C C C C C C C C C C C C C C C C C
charge: -0.256503 -0.059191 -0.268416 -0.263732 -0.057858 -0.335150 0.132260 -0.079743 0.234229 0.318109 0.406809 -0.061273 0.138475 -0.056640 -0.225834 -0.237990 -0.083207 0.170820 -0.132010 0.204611 0.225133 -0.025383 -0.126589 0.261209 0.177862
polarizability: 2.76759684e+02 -4.66875381e-01 2.38003317e+02 1.22017401e+01 -2.61685877e-01 1.68646760e+02
1716.lowfreq: -0.0006 0.0001 0.0003 2.3523 5.9751 7.7309 23.6056 30.6752 42.1747
frequency: 23.4056 30.6492 42.1707 64.1465 81.9281 89.8886 102.6055 136.0674 141.0275 162.3719 168.4002 180.2072 199.5639 206.3108 212.3649 221.8417 243.6717 257.9134 269.0751 290.9643 300.3181 313.0408 326.5109 335.0032 340.6522 356.1187 397.2709 428.5231 443.7218 477.6368 498.6443 501.6770 505.7021 526.4185 544.8416 551.4987 567.6434 596.7205 601.2984 646.8664 675.0081 682.4508 695.0781 702.2875 725.9744 736.8446 760.6005 778.7586 782.1534 808.0967 810.4663 837.2666 838.5013 855.1378 871.5344 883.9297 889.4184 908.5138 946.6103 956.0131 973.0412 1007.9790 1025.2238 1043.2567 1049.6907 1072.5445 1073.2254 1085.9700 1103.2877 1118.5455 1129.4051 1132.0282 1143.7941 1152.8362 1159.3892 1176.8402 1183.7351 1204.4988 1218.0119 1219.6673 1243.1831 1252.2459 1265.1776 1272.8778 1292.2840 1327.7428 1343.2033 1359.3403 1360.4826 1390.7210 1395.9870 1401.4048 1409.0508 1420.9583 1436.5421 1456.0370 1464.1269 1465.3195 1466.2901 1467.1367 1471.0553 1475.7839 1484.1980 1485.2101 1487.7652 1598.3652 1620.2841 1625.3611 1629.9241 2965.8468 2968.2663 2990.1987 2991.3105 2999.8205 3014.1132 3058.7839 3089.2269 3089.7475 3111.3236 3116.0115 3126.1154 3128.9708 3131.0089 3148.6046 3165.2465 3167.7742 3193.7059 3504.5043 3541.8537
redmass: 5.3027 5.0364 4.8998 4.1323 3.9412 4.0937 2.6060 5.0203 5.7876 1.8362 1.6456 5.0259 1.3505 1.5620 4.0468 2.9676 4.1010 3.3054 3.3242 1.8840 3.4265 2.0972 4.4659 3.7095 2.1761 5.8291 4.2050 3.4588 4.8509 4.2169 5.3462 1.1530 4.8804 4.9387 4.0974 4.4714 5.2683 5.4395 5.2130 8.7625 7.9678 5.9671 5.4349 4.2269 2.7289 5.7016 2.3239 4.2249 2.8768 4.4080 4.2876 4.4856 4.9602 1.5723 1.5354 1.4721 2.1395 3.1880 1.8314 1.3870 5.2194 3.2656 1.8157 3.8082 2.3703 2.0121 1.5837 2.3012 2.0312 1.2547 1.1886 1.7563 1.8343 1.3955 3.8571 1.4666 2.0524 2.7578 1.3608 1.6621 1.5719 2.4234 5.0899 1.7586 1.4873 1.3834 1.4918 1.3276 1.5392 1.4051 1.3872 3.8725 4.9551 6.0196 1.2890 1.0537 2.0762 2.2098 1.0777 1.1001 1.4814 1.0527 1.3647 1.7372 1.0684 7.0662 9.8078 6.8179 8.2337 1.0814 1.0324 1.0623 1.0360 1.0838 1.0361 1.1045 1.0993 1.0998 1.1080 1.1001 1.1000 1.1000 1.0872 1.0912 1.0926 1.0983 1.0934 1.0644 1.0650
irintensity: 0.0454 0.1977 2.0131 3.0143 2.1427 2.8607 11.4420 2.3697 1.3231 0.6159 0.7167 1.6262 5.1371 0.2897 1.9123 0.9576 1.1876 2.5808 0.7035 41.6259 1.6681 42.4594 2.3857 7.9900 39.1745 2.1611 19.8830 19.3883 12.5809 4.1784 5.0564 115.8638 2.5171 9.3539 6.6299 2.5517 7.9270 1.6002 6.6320 5.3424 1.0753 7.6626 7.5460 5.0802 17.3488 6.5385 49.1234 8.0862 21.6393 32.6332 10.1651 49.4118 61.9893 27.5149 23.9450 14.8852 63.0702 23.6914 15.5188 2.5976 172.1833 56.9825 13.4576 90.8500 63.2801 19.7002 17.8104 42.5484 132.9325 0.0609 9.3925 38.8224 94.4897 1.5509 53.4060 58.6421 67.0357 34.9344 1.7719 27.3363 55.8529 142.7745 60.5610 54.2657 69.8967 19.2892 47.6724 3.0254 10.0904 28.7753 96.9106 38.3667 27.3442 2.0424 43.7515 2.8398 80.1519 206.3348 9.6785 30.0081 24.1138 20.8578 35.2345 11.4535 10.0188 12.4063 12.3518 24.0313 14.4405 4.2035 67.8143 155.3639 15.2636 12.7219 11.1393 40.7819 29.9187 20.3920 31.1077 17.5563 13.6046 21.0463 4.1785 12.0863 2.1221 15.2572 0.2466 85.7385 4.9852
temp: 298.150 k
press: 1.00000 atm
elementType: 8 8 8 8 8 8 6 6 6 6 6 6 6 6 6 6 6 6 6 6 6 6 6 6 6 1 1 1 1 1 1 1 1 1 1 1 1 1 1 1 1 1 1 1 1
symmnumber: 1
zpe: 925148.7 jmol-1
zpe.correction: 0.352371 hartree
zpe.thermalcorrener: 0.375689 hartree
zpe.thermalcorrenthalpy: 0.376633 hartree
zpe.thermalcorrgfe: 0.299957 hartree
zpe.sumelectzpe: -1185.490773 hartree
zpe.sumelectthermal: -1185.467454 hartree
zpe.sumelectthermalent: -1185.466510 hartree
zpe.sumelectthermalfe: -1185.543186 hartree
dipole: -5.0143 -2.6931 0.5894
dipole: 5.7222
quadrupole: -120.3088 -142.5907 -144.0034
quadrupole: 1.0887 -2.3604 4.7494
quadrupole: 15.3255 -6.9564 -8.3691 1.0887 -2.3604 4.7494
hfenergy: -1185.8431435 hartree
pointgroup: C01 [X(C19H20O6)]
dipole: -1.9703684 1.07653 -0.1641491 debye
polarizability: 274.6735995|-1.1452519|237.7586285|-19.2198949|-4.004282|170.9775326 unknown
InChI: InChI=1S/C19H20O6/c1-10-17(11-5-4-6-13(22-3)18(11)20)12-7-15-16(24-9-23-15)8-14(12)25-19(10,2)21/h4-8,10,17,20-21H,9H2,1-3H3
charge 0 multiplicity 1
45 atoms
O  2.318984 -2.15571 -0.522827
O  1.529565 -2.965726 1.611901
O  2.696511 3.372673 0.220854
O  4.607634 2.185338 -0.609139
O  -2.454088 -0.102303 2.06423
O  -4.602349 1.161509 1.168202
C  -0.122965 -2.285117 -0.140746
C  -0.175957 -0.829423 0.432806
C  1.251451 -2.937424 0.183334
C  1.138636 -0.079456 0.171226
C  -1.384774 -0.076162 -0.128027
C  -1.299564 -3.1352 0.379474
C  2.293271 -0.761272 -0.302251
C  1.431351 -4.364868 -0.31311
C  1.2125 1.3288 0.396412
C  3.514692 -0.087932 -0.58978
C  -2.47673 0.245799 0.704067
C  2.411778 1.9796 0.127182
C  -1.455426 0.305765 -1.49493
C  3.538947 1.284746 -0.366192
C  -3.614863 0.927194 0.1848
C  -2.580058 0.977501 -2.010338
C  -3.678337 1.294599 -1.170531
C  4.159265 3.470422 -0.005758
C  -5.820111 1.859831 0.75519
H  -0.176515 -2.220295 -1.245867
H  -0.340158 -0.906869 1.527734
H  -1.375682 -4.09451 -0.161185
H  -1.175014 -3.351193 1.455889
H  -2.252048 -2.594382 0.245416
H  1.163908 -4.440393 -1.380136
H  2.48707 -4.654106 -0.187347
H  0.804118 -5.053921 0.27296
H  0.333829 1.877409 0.746706
H  4.37711 -0.648244 -0.955197
H  1.506517 -2.042989 1.976581
H  -0.603272 0.085664 -2.147701
H  -2.611005 1.264438 -3.066423
H  -4.549101 1.819117 -1.575303
H  4.359639 4.286771 -0.71577
H  4.671272 3.604763 0.967025
H  -3.302803 0.212786 2.476171
H  -6.360184 1.285449 -0.021545
H  -5.585643 2.872882 0.376231
H  -6.438101 1.934239 1.661813
