program: Gaussian 09
title: 000146632
version: EM64L-G09RevD.01
frameworkgroup: C1[X(C12H4Cl5NO2)]
method: RPBEPBE
basis: SDD
operation: Freq
keyword: #p
keyword: freq=noraman
keyword: PBEPBE/SDD
title: #p freq=noraman PBEPBE/SDD
converged: YES YES NO NO
title: Mulliken charges:
elementType: Cl Cl Cl Cl Cl O O N C C C C C C C C C C C C H H H H
charge: 0.028613 0.052945 0.013662 0.062330 -0.013503 -0.185279 -0.180099 0.015066 0.226753 0.530854 0.254098 -0.337061 -0.392441 -0.323062 -0.320205 -0.024131 -0.090999 -0.225151 -0.114366 -0.104594 0.281975 0.265137 0.309692 0.269766
chargesum: 0.00000
title: Mulliken charges with hydrogens summed into heavy atoms:
elementType: Cl Cl Cl Cl Cl O O N C C C C C C C C C C C C
charge: 0.028613 0.052945 0.013662 0.062330 -0.013503 -0.185279 -0.180099 0.015066 0.226753 0.530854 0.254098 -0.337061 -0.110466 -0.057925 -0.010512 -0.024131 -0.090999 0.044616 -0.114366 -0.104594
polarizability: 3.03793795e+02 6.61145126e+00 1.84951368e+02 1.22576302e+01 -8.13474002e+00 1.18032566e+02
1716.lowfreq: -4.5856 -3.1762 -0.0024 -0.0019 0.0014 4.2570 22.4673 35.7773 37.7700
frequency: 22.4373 35.7735 37.7669 57.6857 76.7742 86.4037 120.2663 140.0941 153.7826 180.3564 188.1132 199.8697 211.3358 226.7354 256.8450 307.5249 313.7926 317.2482 336.9205 365.5677 377.5631 426.7079 431.5446 475.9650 512.5426 538.3121 559.2279 581.2634 618.7121 627.9797 655.8265 678.8990 709.3943 729.1857 738.8463 779.8917 804.3988 836.2106 848.0922 880.7094 911.7207 965.5265 1008.0421 1056.2354 1090.8367 1106.8558 1149.3139 1171.5489 1211.2875 1246.4110 1275.2199 1317.4425 1347.4419 1350.2512 1373.5484 1401.1254 1404.6239 1474.9384 1529.5036 1563.8637 1576.1693 1603.0543 3154.4367 3171.7836 3179.2029 3188.6064
redmass: 14.3849 16.0248 15.8360 15.0687 31.2480 17.2254 7.0052 17.4562 7.8539 15.9121 13.8367 25.7148 34.2879 20.4208 6.6091 8.7279 9.3717 25.3138 28.7312 9.6131 8.4028 4.1709 9.1212 6.4570 8.6999 6.0298 8.2250 4.1029 10.9791 8.7915 7.8633 7.9614 10.9035 6.3481 5.4268 8.2428 10.4239 1.4135 8.5468 1.4535 1.4426 1.3590 9.9559 3.7579 2.6847 4.1697 1.4852 1.8880 11.7128 1.7037 2.4225 5.4742 7.2553 4.7785 10.6326 5.2450 4.1315 3.2310 9.8523 8.6148 8.2427 7.7282 1.0898 1.0929 1.0967 1.0930
irintensity: 0.5272 0.2234 0.1312 0.2879 0.0427 0.1407 0.0322 1.5912 0.9687 3.3347 0.1464 0.3573 0.0368 0.2754 2.1825 2.5851 1.1527 0.4085 0.0718 2.4317 2.3984 4.4537 11.8908 11.1133 1.8033 3.8554 17.7118 19.4181 16.4042 0.8927 8.8285 2.4229 48.4545 0.6273 9.6829 43.8720 24.7672 23.5328 14.8466 16.3559 19.2340 0.0876 14.5307 18.9255 42.8485 24.6493 9.7557 43.1075 190.6414 8.8762 29.8458 54.5160 2.2516 28.0667 79.1723 196.5936 28.0481 70.0997 24.3057 1.1421 0.5841 15.9286 2.5470 0.3383 0.3291 9.3161
temp: 298.150 k
press: 1.00000 atm
elementType: 17 17 17 17 17 8 8 7 6 6 6 6 6 6 6 6 6 6 6 6 1 1 1 1
symmnumber: 1
zpe: 342583.9 jmol-1
zpe.correction: 0.130483 hartree
zpe.thermalcorrener: 0.148974 hartree
zpe.thermalcorrenthalpy: 0.149919 hartree
zpe.thermalcorrgfe: 0.080716 hartree
zpe.sumelectzpe: -2963.678092 hartree
zpe.sumelectthermal: -2963.659600 hartree
zpe.sumelectthermalent: -2963.658656 hartree
zpe.sumelectthermalfe: -2963.727859 hartree
dipole: -1.9446 3.3376 -3.1040
dipole: 4.9553
quadrupole: -151.6885 -148.7503 -152.1792
quadrupole: -6.0600 3.2779 1.0537
quadrupole: -0.8158 2.1223 -1.3065 -6.0600 3.2779 1.0537
hfenergy: -2963.8085749 hartree
pointgroup: C01 [X(C12H4Cl5N1O2)]
dipole: 0.7854932 0.1772721 -1.7755085 debye
dipolederiv: -0.2459498 -0.2128474 -0.1523414 -0.212482 -0.3186219 -0.2219503 -0.1657383 -0.225793 -0.1627973 -0.2223959 0.2164806 0.1642973 0.2658813 -0.2962975 -0.2328148 0.2070656 -0.2325905 -0.1626848 -0.2328544 -0.2035533 -0.1573221 -0.2711481 -0.3873325 -0.2850615 -0.2083238 -0.2917616 -0.2396269 -0.7625996 -0.0353693 -0.0227554 -0.0162348 0.0050565 -0.0073282 -0.0013522 -0.0096445 0.0093718 -0.9189881 -0.0466261 0.1310644 -0.0507621 -0.0466021 0.0200772 0.0981074 0.0199561 -0.1030895 -0.5300208 -0.0903825 -0.1375055 -0.0979608 -0.2491018 0.0630857 -0.2562162 0.0422843 -0.7483328 -0.7782789 -0.1885318 -0.0214976 -0.1782957 -0.294714 0.0635462 -0.0276518 0.1190631 -0.5146937 1.0825149 0.3826484 0.0035203 0.377481 0.3648831 -0.2018034 0.0664802 -0.2385901 1.4148489 0.2977875 -0.088731 0.0704103 -0.0530765 -0.0358586 0.0236289 -0.1340683 -0.0628466 0.0722096 0.2618102 -0.083597 -0.022655 -0.1841885 0.0034619 -0.0852224 0.0699294 -0.0510607 0.0361529 0.1082139 -0.0961031 0.1655417 -0.0703366 0.025276 0.1086905 0.2433402 0.0952449 -0.3422689 0.0891767 0.3886361 0.252381 0.4134641 0.3532861 0.2773248 0.2492437 0.3079661 0.1705859 -0.21409 -0.0640011 -0.0725073 -0.0453796 -0.1236533 -0.0484778 0.0156925 -0.0656377 -0.1511137 -0.1992018 -0.0327217 0.122593 -0.0091215 -0.0895879 -0.036647 0.0599589 -0.0367022 0.0231752 -0.4277762 0.0250854 -0.0930668 -0.0195981 -0.0397459 -0.0464885 0.1608876 0.0185945 -0.0411982 0.0968327 -0.3898541 -0.2795813 -0.4820702 0.3894095 0.3044524 -0.3600801 0.2948903 0.2247451 0.1264308 0.3451695 0.2769709 0.4232634 0.5671905 0.4657481 0.2668778 0.4653514 0.3323018 -0.2641237 0.0059142 -0.0188837 0.0204018 -0.0611124 -0.0412563 -0.005354 -0.0311547 0.0666096 1.0033763 0.0339989 0.006897 0.0352892 -0.2131124 -0.1322896 0.0077837 -0.1303139 -0.1414513 1.4497417 0.0922444 -0.210348 0.128458 -0.055642 -0.0226775 -0.2565089 -0.0170037 -0.0163923 0.0687797 0.029214 0.0329285 0.0464736 0.0719306 -0.0488985 0.0449089 -0.0515177 0.1061027 0.0383713 0.0143594 -0.0777797 0.0259268 0.1233744 0.020096 -0.080635 0.0347852 0.0285683 0.1098086 0.0100558 -0.0062476 -0.0241573 0.159105 0.0259615 -0.0404078 0.01253 0.1137872 0.0634348 -0.0114883 0.0458871 -0.0218271 0.1484086 0.0383045 0.0460607 0.033951 0.0251905 unknown
polarizability: 303.4088583|15.7816441|135.5149242|-0.9342598|30.4433169|167.8539471 unknown
InChI: InChI=1S/C12H4Cl5NO2/c13-5-1-2-6(9(3-5)18(19)20)7-4-8(14)11(16)12(17)10(7)15/h1-4H
charge 0 multiplicity 1
24 atoms
Cl -0.337967 2.22497 1.317859
Cl -3.552473 2.167245 1.338711
Cl -3.446961 -2.241357 -2.087343
Cl -5.137963 -0.069168 -0.353348
Cl 5.63155 0.264848 -0.935818
O  2.164514 -0.501522 2.992245
O  0.224407 -1.224268 2.038138
N  1.389035 -0.676561 1.977461
C  1.007281 0.013131 -0.438683
C  -0.487605 -0.001209 -0.355882
C  1.894425 -0.247456 0.641432
C  -1.225968 0.956722 0.383674
C  -1.201367 -0.958569 -1.112424
C  1.601901 0.339174 -1.684978
C  3.296619 -0.163898 0.511466
C  -2.639079 0.943275 0.390512
C  -2.606682 -0.977719 -1.108675
C  3.001062 0.409817 -1.853968
C  -3.342348 -0.034989 -0.357706
C  3.832532 0.163941 -0.743601
H  -0.654375 -1.712493 -1.684741
H  0.949504 0.561916 -2.535195
H  3.92901 -0.361497 1.380218
H  3.432347 0.66277 -2.826455
