program: Gaussian 09
title: 000146648
version: EM64L-G09RevD.01
frameworkgroup: C1[X(C15H18N2O3S)]
method: RPBEPBE
basis: SDD
operation: Freq
keyword: #p
keyword: freq=noraman
keyword: PBEPBE/SDD
title: #p freq=noraman PBEPBE/SDD
converged: YES YES NO NO
title: Mulliken charges:
elementType: S O O O N N C C C C C C C C C C C C C C C H H H H H H H H H H H H H H H H H H
charge: 0.149150 -0.291232 -0.297416 -0.298028 -0.212399 -0.355488 -0.104883 -0.524152 -0.377746 -0.225710 0.147662 -0.241365 0.138579 0.410783 -0.602307 -0.514032 0.245707 0.194357 -0.865095 -0.530500 -0.527402 0.281978 0.303564 0.242198 0.257808 0.272392 0.311279 0.244009 0.251995 0.291764 0.291001 0.259086 0.259206 0.224250 0.228976 0.263922 0.231978 0.242976 0.223136
chargesum: 0.00000
title: Mulliken charges with hydrogens summed into heavy atoms:
elementType: S O O O N N C C C C C C C C C C C C C C C
charge: 0.149150 -0.291232 -0.297416 -0.298028 -0.212399 -0.044208 0.177095 -0.220588 0.122260 0.046681 0.147662 0.002644 0.138579 0.410783 -0.350312 -0.222268 0.245707 0.194357 -0.055802 0.186648 0.170688
polarizability: 2.85584522e+02 -1.65841628e+00 2.17859843e+02 -7.53602397e+00 1.94219130e+00 1.34024459e+02
1716.lowfreq: -3.5009 0.0014 0.0015 0.0015 4.1822 5.6736 36.4962 42.9573 64.8302
frequency: 36.4104 42.9311 64.8023 66.7025 73.0371 104.7872 123.2686 131.3281 138.7168 149.6069 151.8291 170.4606 171.1740 182.2896 205.6371 228.2119 248.1861 263.8777 270.8707 294.6334 321.2017 331.8677 357.2320 374.0503 428.5450 451.2348 479.6992 487.6850 503.4211 566.8030 579.7888 606.9635 630.0845 650.7585 671.5212 682.7290 709.5692 716.6101 733.7637 752.7300 761.3427 792.1971 829.4559 865.0358 884.8020 918.2744 930.3137 947.3425 958.1416 964.1553 969.5700 969.7850 997.1268 1008.1630 1028.2295 1084.0093 1107.8865 1113.0872 1115.7124 1131.5262 1140.4911 1150.0770 1153.7628 1162.8706 1181.1453 1197.4655 1213.1405 1233.8992 1258.8267 1279.7772 1298.9656 1303.2782 1330.7837 1337.5688 1340.6831 1352.6977 1392.3472 1399.3799 1423.1719 1438.2041 1456.1918 1456.9440 1459.8833 1467.2465 1475.4954 1481.5901 1483.7770 1487.8026 1489.3206 1544.0116 1565.2201 1620.1123 1638.8282 2960.3236 2966.3480 2976.2831 2978.6949 3007.6574 3016.1856 3026.8042 3060.0726 3079.2642 3117.9066 3124.7485 3127.0872 3129.1600 3136.3485 3164.3650 3174.2495 3206.1840 3518.6142
redmass: 5.1064 4.2681 4.6455 3.5946 3.7476 2.9173 3.1156 3.7540 2.9464 1.1074 1.2469 4.0246 1.1082 3.8650 4.1673 5.0691 4.7040 5.3165 6.0794 5.1912 6.2402 3.4667 6.0970 4.7149 4.8441 4.3474 4.6563 3.9224 3.2765 1.7167 6.0803 5.6684 6.0485 5.5264 6.7796 5.6371 1.5628 3.7885 3.4100 5.1801 5.8589 5.0187 4.6403 1.7487 3.6980 3.6988 1.9087 1.2252 4.5217 1.2458 1.3864 1.9196 1.8214 2.6899 2.8429 3.7143 1.1941 1.2449 1.2487 1.9319 2.2496 1.2390 1.3732 1.9619 4.4457 1.8108 1.6240 1.3077 1.5848 1.6310 2.4167 1.9100 1.4323 1.9559 1.6875 1.5520 7.0072 3.7778 1.1802 1.2417 1.0648 1.0618 1.0603 1.0567 1.0659 1.3910 1.7546 1.2212 1.7745 6.2986 6.3650 7.2152 6.5798 1.0823 1.0306 1.0595 1.0313 1.0287 1.1020 1.0877 1.1047 1.1028 1.1019 1.1056 1.1038 1.1026 1.0913 1.0915 1.0880 1.1067 1.0749
irintensity: 0.6075 2.1630 2.9818 2.2264 0.2755 7.7766 1.0903 2.6783 5.9175 1.0124 0.5951 3.1109 0.2843 3.1175 1.4835 14.5590 4.9383 9.0270 14.7603 10.1006 14.7053 7.5471 6.9910 7.7483 16.1606 0.7882 34.9511 14.6906 4.4073 71.8248 17.7529 24.0332 5.9068 9.1917 17.0722 9.1015 45.5446 31.7934 19.7817 54.4721 12.5226 6.8513 12.4492 19.8436 13.4032 11.1021 52.8883 3.5640 63.7960 20.6172 25.6665 20.2075 5.7089 1.7531 10.2690 47.3947 14.7650 11.4186 14.1446 3.5477 16.3105 0.5755 8.4089 27.0177 22.6467 175.2433 37.9146 24.1365 51.6810 60.4607 111.9658 4.7036 19.4108 3.3570 6.7736 21.4825 12.0644 269.5265 0.7764 14.9790 18.1597 13.5842 12.7572 16.7473 19.4744 98.3461 246.6316 4.1497 23.6996 142.1501 167.4905 132.6725 4.0670 13.5681 69.5036 33.6184 86.4747 22.5012 15.2454 20.2705 30.7082 23.0827 30.6005 13.8850 20.0741 6.7117 5.6132 3.2018 3.5452 11.9418 19.5389
temp: 298.150 k
press: 1.00000 atm
elementType: 16 8 8 8 7 7 6 6 6 6 6 6 6 6 6 6 6 6 6 6 6 1 1 1 1 1 1 1 1 1 1 1 1 1 1 1 1 1 1
symmnumber: 1
zpe: 804586.9 jmol-1
zpe.correction: 0.306451 hartree
zpe.thermalcorrener: 0.327509 hartree
zpe.thermalcorrenthalpy: 0.328453 hartree
zpe.thermalcorrgfe: 0.256548 hartree
zpe.sumelectzpe: -1314.026458 hartree
zpe.sumelectthermal: -1314.005400 hartree
zpe.sumelectthermalent: -1314.004456 hartree
zpe.sumelectthermalfe: -1314.076361 hartree
dipole: 0.2313 3.1640 1.4831
dipole: 3.5020
quadrupole: -111.1840 -145.3802 -123.7045
quadrupole: -10.0376 -0.6776 -4.7975
quadrupole: 15.5722 -18.6240 3.0518 -10.0376 -0.6776 -4.7975
hfenergy: -1314.3329091 hartree
pointgroup: C01 [X(C15H18N2O3S1)]
dipole: -0.094109 -1.1613797 0.7352606 debye
polarizability: 285.327128|-0.0389396|216.0180261|9.987008|-12.3717314|136.1236704 unknown
InChI: InChI=1S/C15H18N2O3S/c1-19-12-7-9-10(8-13(12)20-2)16-14(21-3)11-5-4-6-17(11)15(9)18/h4-5,7-8,11,14,16H,6H2,1-3H3
charge 0 multiplicity 1
39 atoms
S  -2.939083 -2.874787 0.433331
O  -0.723055 2.902969 -0.894302
O  3.694906 -1.665863 -0.038263
O  3.802477 1.210943 0.551854
N  -2.237466 1.231472 -0.384609
N  -1.017484 -1.383965 -1.011245
C  -2.611237 -0.017148 0.331055
C  -2.382423 -1.271973 -0.539394
C  -3.389344 2.156644 -0.55461
C  -4.081386 0.221956 0.642055
C  -0.941395 1.691857 -0.555697
C  -4.50607 1.409052 0.142696
C  0.181686 0.726696 -0.32031
C  0.129041 -0.687532 -0.560029
C  1.340124 -1.434732 -0.472391
C  1.421758 1.310921 0.050312
C  2.562431 -0.832569 -0.132455
C  2.598983 0.562279 0.175481
C  -1.655118 -2.895253 1.814233
C  4.849711 -1.271247 -0.883425
C  4.280925 0.839323 1.903288
H  -2.004609 -0.124201 1.255356
H  -3.100606 -1.288674 -1.3790
H  -3.596612 2.349512 -1.626135
H  -3.156252 3.138308 -0.097079
H  -4.673624 -0.516346 1.185252
H  -0.820595 -2.273878 -1.476299
H  -5.520157 1.809322 0.21806
H  1.343379 -2.511073 -0.680501
H  1.455273 2.393198 0.209496
H  -0.666419 -2.638568 1.402842
H  -1.632667 -3.926177 2.200457
H  -1.92682 -2.201742 2.624472
H  4.585911 -1.385272 -1.951643
H  5.654783 -1.972826 -0.618004
H  5.150788 -0.229269 -0.679616
H  5.219893 1.3953 2.047985
H  4.463331 -0.249484 1.97297
H  3.541324 1.145029 2.667712
