program: Gaussian 09
title: 000146618
version: EM64L-G09RevD.01
frameworkgroup: C1[X(C14H18N2O2)]
method: RPBEPBE
basis: SDD
operation: Freq
keyword: #p
keyword: freq=noraman
keyword: PBEPBE/SDD
title: #p freq=noraman PBEPBE/SDD
converged: YES YES NO NO
title: Mulliken charges:
elementType: O O N N C C C C C C C C C C C C C C H H H H H H H H H H H H H H H H H H
charge: -0.256895 -0.290737 -0.154348 -0.423884 -0.128309 -0.477356 -0.467683 -0.340478 -0.116388 0.147943 0.001551 0.385516 0.369253 -0.466979 -0.467469 -0.509624 -0.213826 -0.808611 0.277075 0.217819 0.228491 0.221110 0.252664 0.226396 0.258143 0.215247 0.292328 0.210153 0.234538 0.192111 0.238345 0.226332 0.223867 0.226457 0.270914 0.206334
chargesum: 0.00000
title: Mulliken charges with hydrogens summed into heavy atoms:
elementType: O O N N C C C C C C C C C C C C C C
charge: -0.256895 -0.290737 -0.154348 -0.131556 0.148766 -0.031046 0.006091 0.144060 0.098859 0.147943 0.001551 0.385516 0.369253 -0.256825 -0.232932 0.147164 0.010041 -0.104905
polarizability: 2.19245490e+02 -1.67172579e-02 1.76569734e+02 1.22186740e+00 -1.08771056e+01 1.15196760e+02
1716.lowfreq: -8.5082 -0.0008 -0.0006 -0.0006 7.5713 13.5268 43.0265 60.5659 81.9859
frequency: 42.9824 60.5246 81.9732 101.1956 116.4667 150.6917 162.8798 182.4817 199.6452 202.3325 221.9409 245.6303 261.5652 295.6506 338.4711 344.7871 366.5962 404.2697 434.9781 478.3854 495.0056 525.7754 542.8376 559.3162 576.6994 593.6275 630.0769 680.7676 698.6524 736.9467 761.1499 782.8674 800.9720 844.7258 852.8089 868.2418 871.6735 902.7395 926.0674 945.3691 964.2145 972.2281 1006.3754 1014.7557 1033.2633 1044.9748 1066.7862 1090.2410 1108.0601 1111.0490 1114.6097 1139.1609 1148.0615 1169.7731 1184.2600 1193.4539 1194.0335 1234.3304 1243.3544 1268.0664 1272.8015 1302.6948 1310.1624 1318.9987 1328.1272 1341.4205 1346.8787 1377.4182 1384.6590 1401.1737 1426.7725 1431.9339 1443.7514 1457.0472 1460.0821 1462.8420 1471.2289 1477.0401 1481.4503 1489.0983 1514.6755 1548.3319 1596.7687 1604.4937 2917.0185 2928.0725 2991.4450 2992.3435 2997.8655 3013.1253 3023.3570 3034.5852 3066.1589 3072.0039 3081.2777 3089.9485 3104.3637 3106.6239 3109.0822 3132.0175 3155.7474 3544.2938
redmass: 4.0234 4.6538 3.7808 2.8112 2.7043 3.1953 1.1048 2.2940 1.6111 2.4013 2.9548 2.8968 3.7999 4.4091 4.7569 4.5293 5.6208 4.0551 3.8961 1.6831 2.2566 4.9079 3.3099 3.5806 4.2295 5.3006 2.4441 4.1094 4.7496 5.5904 2.0264 2.6420 4.6179 2.1920 1.7021 1.4494 3.4101 3.5239 2.4633 2.7011 1.3344 2.1106 2.3515 5.9425 1.8555 1.5808 2.9040 1.8036 1.7090 1.7832 1.7882 1.4172 1.6906 1.5551 1.4026 1.6094 2.3063 1.3482 1.6600 1.8057 1.9038 1.4408 1.5413 1.3982 1.3621 1.6124 1.4456 4.0032 5.0275 1.2164 1.3469 1.9102 1.4601 1.0539 1.3732 1.0992 1.0924 1.2594 1.0838 1.0952 1.6606 6.8404 5.8394 5.5225 1.0824 1.0407 1.0371 1.0652 1.0755 1.0706 1.0956 1.0629 1.0983 1.1023 1.0983 1.0986 1.0879 1.1047 1.0982 1.0893 1.0992 1.0760
irintensity: 0.1438 1.3035 0.8448 6.3003 5.1512 2.4507 1.0302 1.0153 2.2507 0.2002 4.7584 3.7230 2.5983 4.7680 6.0631 1.0545 4.3639 0.3809 10.9050 33.7137 18.2376 5.2062 7.4283 1.1585 0.2727 3.1471 3.4051 33.0522 20.9496 11.1828 21.5777 59.3134 0.9561 6.1797 6.7858 5.9220 36.6308 10.3706 6.9371 25.8688 0.4678 0.0539 22.5639 195.2295 12.8247 9.2081 0.1031 5.7505 10.1739 14.5539 45.1726 4.4087 3.9354 2.3253 1.1901 5.5230 6.7771 16.2515 7.3600 13.1797 21.1338 7.3028 22.6566 9.0076 6.7670 25.1104 61.1144 2.8281 225.3840 30.1690 8.3589 34.5674 10.6507 7.5167 37.4974 5.8577 17.9287 82.4842 9.0843 5.2054 54.3786 238.9638 95.8521 86.5414 54.2033 109.2341 26.1713 41.0828 4.0567 54.8981 49.7774 54.1810 11.8944 19.6636 23.4821 14.9368 14.6512 36.9736 22.1095 17.1869 32.9279 11.9981
temp: 298.150 k
press: 1.00000 atm
elementType: 8 8 7 7 6 6 6 6 6 6 6 6 6 6 6 6 6 6 1 1 1 1 1 1 1 1 1 1 1 1 1 1 1 1 1 1
symmnumber: 1
zpe: 784750.3 jmol-1
zpe.correction: 0.298896 hartree
zpe.thermalcorrener: 0.315335 hartree
zpe.thermalcorrenthalpy: 0.316279 hartree
zpe.thermalcorrgfe: 0.255575 hartree
zpe.sumelectzpe: -802.898603 hartree
zpe.sumelectthermal: -802.882164 hartree
zpe.sumelectthermalent: -802.881220 hartree
zpe.sumelectthermalfe: -802.941924 hartree
dipole: 2.3618 4.3711 -3.0854
dipole: 5.8484
quadrupole: -97.6929 -96.9819 -110.0341
quadrupole: 0.2957 0.3290 5.3057
quadrupole: 3.8767 4.5877 -8.4645 0.2957 0.3290 5.3057
hfenergy: -803.1974987 hartree
pointgroup: C01 [X(C14H18N2O2)]
dipole: -0.8707253 1.7543969 1.2076034 debye
polarizability: 219.0021087|-2.3883426|176.5012206|4.1745135|11.2303929|115.5086547 unknown
InChI: InChI=1S/C14H18N2O2/c1-9-5-3-6-10-12(9)14(17)16-8-4-7-11(16)13(15-10)18-2/h3,5-6,11,13,15H,4,7-8H2,1-2H3
charge 0 multiplicity 1
36 atoms
O  -2.220991 1.283686 -0.859884
O  0.250997 -2.047623 -1.40806
N  -1.128736 -1.037368 0.130677
N  -0.078964 1.865097 0.219129
C  -1.501703 0.02554 1.083606
C  -2.919262 -0.396117 1.54747
C  -3.512124 -1.172732 0.341482
C  -2.287931 -1.855498 -0.313258
C  -1.445156 1.412154 0.394611
C  0.095535 -1.166521 -0.495299
C  1.241892 -0.290115 -0.041903
C  1.124705 1.119386 0.208555
C  2.543191 -0.900819 0.026192
C  2.301429 1.887092 0.462475
C  3.680858 -0.111104 0.305529
C  -2.250877 2.51724 -1.647975
C  3.564195 1.283112 0.500649
C  2.752428 -2.391259 -0.186613
H  -0.791921 0.057241 1.932664
H  -3.536103 0.470491 1.840836
H  -2.826201 -1.06099 2.4260
H  -4.276518 -1.905737 0.650819
H  -3.961889 -0.462301 -0.369548
H  -2.149482 -2.900751 0.02413
H  -2.332926 -1.866079 -1.415164
H  -1.962049 2.172403 1.025459
H  0.062412 2.87237 0.301234
H  2.204067 2.965853 0.643652
H  4.662628 -0.592822 0.36445
H  -2.665589 3.367505 -1.062505
H  -2.9099 2.309743 -2.505087
H  -1.241646 2.782979 -2.018086
H  4.453891 1.890366 0.701124
H  2.003923 -2.998492 0.351729
H  2.641542 -2.654825 -1.251762
H  3.759576 -2.685203 0.157774
