program: Gaussian 09
title: 000146627
version: EM64L-G09RevD.01
frameworkgroup: C1[X(C20H26O2)]
method: RPBEPBE
basis: SDD
operation: Freq
keyword: #pfreq=noraman
keyword: PBEPBE/SDD
title: #p freq=noraman PBEPBE/SDD
converged: YES YES NO NO
title: Mulliken charges:
elementType: O O C C C C C C C C C C C C C C C C C C C C H H H H H H H H H H H H H H H H H H H H H H H H H H
charge: -0.445886 -0.439214 0.352943 0.366751 0.152180 -0.166975 -0.619043 -0.569144 -0.510550 -0.562263 -0.511766 -0.157277 -0.492607 -0.837524 -0.503312 0.251290 -0.581601 0.298931 -0.341956 -0.538760 -0.447605 0.285244 0.223575 0.206489 0.243458 0.238369 0.207786 0.246838 0.195747 0.199750 0.251418 0.213993 0.217796 0.204074 0.215162 0.192830 0.220396 0.226786 0.250284 0.216820 0.219512 0.332751 0.222342 0.226325 0.222073 0.254735 0.217138 0.351696
chargesum: 0.00000
title: Mulliken charges with hydrogens summed into heavy atoms:
elementType: O O C C C C C C C C C C C C C C C C C C C C
charge: -0.113135 -0.087518 0.352943 0.366751 0.152180 0.056600 -0.169095 -0.122989 -0.067964 -0.111095 -0.079976 0.046797 -0.084615 -0.140058 -0.066980 0.251290 -0.132935 0.298931 -0.119883 -0.284024 -0.230467 0.285244
polarizability: 2.79357994e+02 -6.49572676e+00 2.01511402e+02 5.30389234e+00 4.73506385e+00 1.49129089e+02
1716.lowfreq: -10.8185 -8.1580 -0.0006 -0.0003 -0.0002 11.7406 35.2931 57.4331 106.4384
frequency: 34.9701 57.3982 106.4332 119.3131 146.6937 163.7885 198.0717 206.2511 216.2423 228.1144 238.9162 249.6338 262.1090 265.1853 307.1580 337.1318 342.4662 368.6845 371.2584 386.2578 396.5173 402.8683 434.0115 446.5197 459.3650 459.7805 480.0436 503.8324 519.1532 553.8244 558.8038 567.7042 583.8012 619.4508 636.1895 701.3987 709.3766 730.3179 774.3519 780.7250 792.4599 806.1045 810.5414 837.2468 851.3020 881.8392 889.9988 899.1530 921.1138 927.5653 935.7662 940.0716 946.5961 958.0506 966.7677 983.7197 992.9502 1011.4036 1016.1173 1035.7517 1045.1826 1073.8727 1084.2238 1103.1321 1114.3642 1118.8003 1130.8698 1136.7948 1143.5769 1150.4280 1171.4177 1177.7735 1180.5513 1183.3809 1194.7552 1211.4509 1215.1948 1218.6796 1225.1582 1235.0818 1241.4666 1249.8154 1255.9274 1264.5328 1268.9062 1275.3612 1279.0540 1290.0021 1305.1490 1310.7366 1323.2328 1330.0540 1338.5652 1344.7845 1351.2091 1365.7310 1381.8642 1391.4220 1441.4842 1457.0274 1458.6820 1468.5985 1469.5255 1472.0167 1480.4666 1482.6484 1490.7938 1494.2287 1497.9466 1508.3967 1586.5889 1630.6918 2913.6658 2934.6971 2957.6246 2974.4348 2982.3499 2992.5786 2992.8546 2996.6676 2997.2514 3005.1032 3014.3282 3019.4612 3033.7278 3037.1416 3045.8694 3051.3089 3052.1207 3067.4774 3076.3318 3081.0147 3092.6773 3111.0301 3141.0577 3149.5548 3566.1554 3583.1395
redmass: 4.2515 4.0091 3.1784 4.5192 1.3368 3.1002 2.6850 3.2008 2.0208 2.5809 1.6766 2.1990 2.8192 2.3373 3.6593 1.1187 3.5112 1.8733 3.4082 2.4950 3.6462 3.2044 3.2023 2.8809 3.1990 3.1196 2.7942 3.1561 4.4084 3.2946 3.2304 3.2259 4.2426 3.4552 3.7579 3.2048 5.0057 3.5270 2.3478 1.7911 1.7376 1.2958 1.8330 2.2606 1.9477 1.7388 1.7952 2.1561 2.5878 1.5282 2.1992 1.7978 1.5873 2.8759 1.8781 2.7352 2.2296 1.8888 2.0614 2.0509 1.9658 2.5028 1.8785 2.3226 2.0631 2.2784 1.6121 2.0570 2.0199 1.3939 1.7876 1.5217 1.6426 1.4058 1.6606 1.2954 1.4684 1.6738 1.4371 2.0398 1.4053 1.8643 1.7335 1.7881 1.5772 2.0445 1.4261 1.3425 1.4760 1.5748 1.3397 1.4549 1.5548 1.4787 1.8936 1.7025 5.2788 1.2021 2.9168 1.1716 1.0735 1.0851 1.0915 1.0858 1.0732 1.0822 1.0737 2.6727 1.0672 1.0921 7.1748 6.4386 1.0793 1.0826 1.0646 1.0620 1.0595 1.0448 1.0577 1.0577 1.0574 1.0627 1.0629 1.0936 1.0998 1.1019 1.1022 1.1023 1.1017 1.1035 1.1031 1.0981 1.0973 1.0889 1.0915 1.0936 1.0659 1.0660
irintensity: 0.2914 0.6178 0.0721 1.7225 1.4416 1.1641 0.7705 5.4002 10.3452 21.6549 45.6074 41.4983 0.7582 7.0510 9.5643 136.1777 6.8463 0.5625 9.0620 1.8753 0.2886 3.9237 2.2511 5.4220 0.1419 2.0747 0.1283 0.6280 0.7085 4.4837 2.5705 1.9456 5.3414 6.4671 2.3335 2.9164 1.8515 0.4144 1.8486 29.3010 3.1209 1.2190 14.1995 0.1661 7.5292 20.9865 6.1095 33.1890 19.8346 6.3109 3.2520 18.6660 6.4272 3.0268 3.9831 1.8195 11.5024 16.3301 19.4486 38.6374 4.4374 67.6418 2.9237 6.7540 40.5965 12.6541 29.9370 1.7938 8.3841 85.7957 4.2228 38.6564 13.6338 21.0922 6.7231 2.9247 1.4434 5.8279 6.3472 2.5298 4.9476 29.4968 6.4149 4.6212 6.3792 30.4636 20.2386 1.9825 2.2151 9.3361 1.9061 0.2058 1.5341 2.6622 0.3762 4.6402 18.9307 23.0774 6.6149 6.2559 0.7287 5.0287 8.3163 10.2385 8.2666 6.8850 22.2571 102.6397 0.2250 10.3159 28.5074 48.2157 5.1000 26.4928 27.6966 35.8388 29.2468 17.8705 28.4600 41.0829 71.2901 48.0013 32.1300 40.2107 22.6513 54.8481 4.4034 6.0284 38.3880 55.1661 76.5345 21.1091 28.0959 21.5934 12.6157 13.9388 3.2597 37.3295
temp: 298.150 k
press: 1.00000 atm
elementType: 8 8 6 6 6 6 6 6 6 6 6 6 6 6 6 6 6 6 6 6 6 6 1 1 1 1 1 1 1 1 1 1 1 1 1 1 1 1 1 1 1 1 1 1 1 1 1 1
symmnumber: 1
zpe: 1087524.2 jmol-1
zpe.correction: 0.414216 hartree
zpe.thermalcorrener: 0.433238 hartree
zpe.thermalcorrenthalpy: 0.434182 hartree
zpe.thermalcorrgfe: 0.369349 hartree
zpe.sumelectzpe: -926.520484 hartree
zpe.sumelectthermal: -926.501463 hartree
zpe.sumelectthermalent: -926.500519 hartree
zpe.sumelectthermalfe: -926.565351 hartree
dipole: -1.1015 0.1780 -1.0379
dipole: 1.5239
quadrupole: -126.8139 -127.9409 -134.2250
quadrupole: -17.0865 2.5063 2.2236
quadrupole: 2.8460 1.7190 -4.5650 -17.0865 2.5063 2.2236
hfenergy: -926.9347005 hartree
pointgroup: C01 [X(C20H26O2)]
dipole: -0.4349001 0.0741321 -0.4059779 debye
polarizability: 279.4323302|-6.2903971|201.3297358|4.7863212|5.4844302|149.236419 unknown
InChI: InChI=1S/C20H26O2/c1-18-7-6-16-15-4-3-14(21)12-13(15)2-5-17(16)19(18)8-10-20(18,22)11-9-19/h3-4,12,16-17,21-22H,2,5-11H2,1H3
charge 0 multiplicity 1
48 atoms
O  -4.796311 -1.340023 0.202059
O  6.251587 -0.085918 0.228568
C  -1.752063 0.68643 -0.055053
C  -2.380972 -0.674088 0.441691
C  -3.810357 -0.299002 -0.075102
C  -0.234222 0.7583 0.198106
C  -2.651686 1.741009 0.669273
C  -2.195233 0.735732 -1.56667
C  -4.073804 1.065966 0.645576
C  -3.589048 0.016719 -1.579058
C  -1.664645 -1.867993 -0.240988
C  0.502952 -0.454729 -0.452396
C  -0.126978 -1.809837 -0.017205
C  -2.375063 -0.920038 1.970664
C  0.427195 2.071083 -0.278317
C  2.022794 -0.373258 -0.222095
C  1.869992 2.162113 0.256377
C  2.664177 0.870538 0.069746
C  2.84101 -1.523529 -0.360021
C  4.069739 0.924561 0.213634
C  4.243205 -1.473602 -0.216621
C  4.857926 -0.23428 0.073232
H  -0.08284 0.692822 1.299891
H  -2.644108 2.714775 0.1477
H  -2.307049 1.922029 1.704163
H  -1.479942 0.218072 -2.227708
H  -2.261588 1.780416 -1.919658
H  -4.464246 0.889388 1.663259
H  -4.819288 1.674016 0.099133
H  -4.393754 0.656431 -1.986973
H  -3.570491 -0.916712 -2.169288
H  -1.863604 -1.88605 -1.328322
H  -2.061308 -2.819534 0.162151
H  0.348209 -0.370276 -1.552091
H  0.12033 -1.994959 1.046552
H  0.329564 -2.639797 -0.589151
H  -1.38186 -1.243736 2.326481
H  -2.660651 -0.035944 2.563715
H  -3.098246 -1.723614 2.20017
H  -0.150751 2.948297 0.070396
H  0.42987 2.101467 -1.386617
H  -5.683582 -1.035393 -0.113959
H  1.834925 2.399808 1.340496
H  2.410776 3.000722 -0.223117
H  2.381521 -2.490118 -0.589566
H  4.569844 1.874179 0.434114
H  4.84381 -2.385481 -0.332033
H  6.708666 -0.954665 0.106861
