program: Gaussian 09
title: 000010106
version: EM64L-G09RevD.01
frameworkgroup: C1[X(C10H18O)]
method: RPBEPBE
basis: SDD
operation: Freq
keyword: #pfreq=noraman
keyword: PBEPBE/SDD
title: #p freq=noraman PBEPBE/SDD
converged: NO YES NO NO
title: Mulliken charges:
elementType: O C C C C C C C C C C H H H H H H H H H H H H H H H H H H
charge: -0.332244 0.485170 0.414052 -0.532480 -0.538029 -0.505664 -0.502053 -0.180239 -0.804942 -0.731557 -0.726244 0.206626 0.236555 0.235081 0.209343 0.234342 0.200945 0.199712 0.234207 0.209191 0.213275 0.227127 0.227064 0.218857 0.216821 0.228109 0.196670 0.207213 0.253094
chargesum: 0.00000
title: Mulliken charges with hydrogens summed into heavy atoms:
elementType: O C C C C C C C C C C
charge: -0.332244 0.485170 0.414052 -0.089299 -0.093605 -0.070378 -0.068134 0.028953 -0.137476 -0.067769 -0.069268
polarizability: 1.22138229e+02 1.16499812e+00 9.93247329e+01 4.10985783e-01 -8.66835104e-01 9.39385485e+01
1716.lowfreq: -28.3387 -22.8548 -8.1905 -0.0009 -0.0007 0.0000 58.1114 99.3403 148.9724
frequency: 57.7420 99.3221 148.9684 183.5562 193.2357 218.3363 225.5509 253.3757 288.0229 309.9879 328.9941 398.8274 436.7225 455.4573 530.7398 559.0279 591.4544 594.3800 747.7076 783.4628 795.9002 816.0061 853.5469 880.7298 893.7405 905.1825 918.4876 925.6168 962.3487 975.8347 985.5278 1008.1069 1017.4275 1062.2682 1089.0606 1109.8455 1140.1122 1167.4329 1173.0821 1187.0829 1197.5155 1217.6169 1225.4746 1241.5461 1253.8603 1257.5667 1304.3300 1313.7492 1331.9410 1352.2918 1375.8677 1391.1348 1393.3918 1449.1601 1461.1966 1462.8358 1466.8558 1468.5303 1473.2887 1473.8728 1481.2218 1486.4084 1492.3792 2967.3045 2973.7600 2979.3553 2984.6806 2999.3794 3005.6043 3014.2385 3022.4744 3056.1718 3061.8122 3064.2002 3069.7119 3073.4616 3078.1095 3079.3943 3088.4861 3089.9668 3096.8556
redmass: 2.4180 1.8584 2.8013 1.2495 1.1198 1.4423 1.2545 1.8801 2.4114 2.4061 2.3038 2.2618 2.7693 2.8945 3.6429 3.7119 3.0098 3.2779 3.2664 5.5578 1.3560 2.8477 1.8110 2.0071 1.8788 2.1011 1.4835 1.5226 1.4656 2.5268 3.3845 1.5404 1.8622 1.5129 1.8063 1.9837 2.0948 1.8102 1.6719 1.6581 1.5717 1.2438 1.3953 1.6533 1.4590 1.8592 1.4676 1.8320 1.8844 1.8519 1.2071 1.2970 1.2455 1.0791 1.0787 1.0802 1.0647 1.0527 1.0493 1.0577 1.0472 1.1075 1.0615 1.0833 1.0355 1.0365 1.0361 1.0577 1.0582 1.0615 1.0622 1.1046 1.1007 1.1029 1.0987 1.0995 1.1016 1.1022 1.1003 1.1042 1.0993
irintensity: 0.1129 0.0362 0.8660 0.6541 0.0298 0.4618 0.4156 1.6016 0.3586 1.1213 0.4068 1.5369 1.2589 3.2598 7.2497 0.3195 1.0424 3.5558 1.3733 26.0373 2.4592 8.8928 5.0583 5.4775 0.4559 6.8584 5.9873 7.8200 0.3760 0.2111 1.5395 12.7157 19.8216 27.1356 21.1753 0.1908 1.4477 2.7287 7.3705 21.3235 17.0528 2.6114 14.0578 0.1180 1.9502 3.5886 3.4269 10.5185 9.1858 1.3949 22.9825 36.4013 7.5026 0.4402 1.6591 1.7060 16.6963 5.9474 9.6783 2.4442 10.2327 15.6882 11.7134 15.6989 25.9322 34.7795 21.7224 23.5260 69.5631 51.3024 23.0618 0.8011 6.2257 5.1366 71.1489 39.6261 9.3412 35.3640 42.6866 76.6424 22.5423
temp: 298.150 k
press: 1.00000 atm
elementType: 8 6 6 6 6 6 6 6 6 6 6 1 1 1 1 1 1 1 1 1 1 1 1 1 1 1 1 1 1
symmnumber: 1
zpe: 679175.1 jmol-1
zpe.correction: 0.258684 hartree
zpe.thermalcorrener: 0.270416 hartree
zpe.thermalcorrenthalpy: 0.271360 hartree
zpe.thermalcorrgfe: 0.222146 hartree
zpe.sumelectzpe: -466.191854 hartree
zpe.sumelectthermal: -466.180122 hartree
zpe.sumelectthermalent: -466.179178 hartree
zpe.sumelectthermalfe: -466.228392 hartree
dipole: -0.2801 1.2919 1.0877
dipole: 1.7118
quadrupole: -65.9255 -69.8513 -69.4358
quadrupole: -0.2309 -0.9320 -1.2864
quadrupole: 2.4787 -1.4471 -1.0316 -0.2309 -0.9320 -1.2864
hfenergy: -466.4505382 hartree
pointgroup: C01 [X(C10H18O1)]
dipole: 0.1124458 0.4700142 -0.4690747 debye
polarizability: 122.1283757|-1.2119497|99.4407677|0.5380414|0.3996188|93.8323675 unknown
InChI: InChI=1S/C10H18O/c1-8(2)10-6-4-9(3,11-10)5-7-10/h8H,4-7H2,1-3H3
charge 0 multiplicity 1
29 atoms
O  0.455411 -0.661225 0.760737
C  -0.528785 0.181011 -0.0046
C  1.688789 -0.157788 0.067607
C  -0.198888 -0.20844 -1.482652
C  0.030201 1.620008 0.255681
C  1.349033 -0.45337 -1.427898
C  1.577515 1.380525 0.312461
C  -1.950669 -0.084689 0.520952
C  2.918768 -0.849271 0.633717
C  -2.99231 0.780374 -0.231226
C  -2.33331 -1.582697 0.480334
H  -0.478917 0.590094 -2.191739
H  -0.733726 -1.128273 -1.772754
H  -0.349687 2.004649 1.218918
H  -0.261456 2.33118 -0.537075
H  1.593712 -1.502486 -1.669065
H  1.912551 0.199438 -2.118236
H  2.132234 1.963624 -0.444352
H  1.984254 1.632558 1.307335
H  -1.945506 0.231334 1.585551
H  3.833625 -0.488152 0.129154
H  3.017397 -0.646467 1.714707
H  2.853251 -1.942059 0.489418
H  -3.038306 0.505254 -1.302037
H  -3.999606 0.62534 0.196747
H  -2.758485 1.858543 -0.163642
H  -2.442283 -1.946068 -0.559251
H  -3.300913 -1.744108 0.990563
H  -1.562694 -2.193138 0.980347
