program: Gaussian 09
title: 000146625
version: EM64L-G09RevD.01
frameworkgroup: C1[X(C22H18O)]
method: RPBEPBE
basis: SDD
operation: Freq
keyword: #pfreq=noraman
keyword: PBEPBE/SDD
title: #p freq=noraman PBEPBE/SDD
converged: YES YES NO NO
title: Mulliken charges:
elementType: O C C C C C C C C C C C C C C C C C C C C C C H H H H H H H H H H H H H H H H H H
charge: -0.275202 0.018584 -0.220742 0.160785 -0.533896 -0.537981 0.357156 0.654186 0.291851 0.386432 -0.743811 -0.497981 0.121047 -0.472998 -0.475221 -0.452620 0.423032 -0.489620 -0.340256 -0.441744 -0.263976 -0.253094 -0.499312 0.236572 0.234108 0.225511 0.264346 0.232797 0.241542 0.223430 0.244746 0.191177 0.207001 0.232458 0.221368 0.239975 0.226495 0.228400 0.202095 0.198578 0.234781
chargesum: 0.00000
title: Mulliken charges with hydrogens summed into heavy atoms:
elementType: O C C C C C C C C C C C C C C C C C C C C C C
charge: -0.275202 0.018584 -0.220742 0.160785 -0.063216 -0.048124 0.357156 0.654186 0.291851 0.386432 -0.511014 -0.256439 0.121047 -0.249569 -0.230475 -0.054441 0.423032 -0.257162 -0.118888 -0.201769 -0.037482 -0.024694 0.136143
polarizability: 4.71620037e+02 5.97817692e+00 2.54253649e+02 1.25649480e+01 -6.94825753e-01 1.09631322e+02
1716.lowfreq: 0.0004 0.0006 0.0006 1.2504 5.0513 7.4521 22.7225 39.7557 59.4454
frequency: 22.5783 39.7458 59.4425 68.9783 84.6017 111.1303 140.2813 145.5003 190.9313 206.2325 220.0088 242.6348 264.9969 276.3800 289.3093 308.7432 359.1841 394.2877 416.7877 446.8227 455.4222 500.1532 505.8350 529.4461 543.1744 556.7654 565.9980 567.8888 610.1020 614.6326 639.1304 649.4445 707.9942 743.9618 757.6148 760.9195 776.4279 793.9910 810.8433 820.6035 824.4759 858.1157 864.3365 877.0790 886.0178 903.2085 919.6804 950.0713 954.3556 962.5769 974.1023 979.2418 989.8738 1003.8360 1017.7617 1032.4942 1038.0735 1047.1840 1087.1471 1111.7873 1125.4052 1139.7278 1147.1554 1158.0464 1178.3171 1182.4444 1189.1508 1196.5475 1209.9877 1232.2599 1237.0697 1242.8236 1250.9203 1274.3141 1280.8573 1323.7322 1341.5708 1364.8266 1377.3772 1393.8020 1405.3885 1408.8655 1434.6943 1436.0639 1451.0305 1455.8258 1460.6012 1465.3383 1467.4596 1470.6702 1481.4651 1486.6852 1509.0847 1552.8804 1582.7354 1607.6473 1620.1097 1625.7406 1632.0910 2903.0927 2921.0966 2961.1351 2983.5235 2991.8658 2997.4824 3029.0316 3057.9368 3101.9940 3113.1008 3119.8078 3121.4918 3131.7795 3140.0816 3142.2501 3146.2684 3152.3584 3165.4392
redmass: 4.0502 4.1945 3.8872 2.3115 4.3327 1.8547 4.1442 4.8974 3.5376 3.4339 1.4692 2.4337 4.1316 3.6186 4.0368 4.1877 4.1815 4.8627 3.4334 5.0625 3.3458 4.5835 5.1803 3.7688 3.5205 3.2732 3.0361 5.7517 4.6897 5.7798 6.0702 4.8313 3.1092 5.5514 1.3150 1.7395 4.2334 1.8604 2.9111 2.1354 1.9572 1.9088 4.2769 4.4136 1.7340 4.5776 2.3672 3.2607 1.3930 1.5722 1.7240 1.3821 1.3718 2.0319 6.1758 4.7798 3.8838 2.3768 2.1544 1.3231 2.1180 1.1878 1.4049 1.3857 1.0859 1.4105 1.3791 1.1126 1.7338 1.8146 1.5317 1.5398 1.8682 1.7988 1.6876 3.1161 3.3310 1.9229 2.2684 2.7361 5.3995 2.5228 1.4782 1.5960 1.6028 1.0551 2.4887 1.5003 1.2007 1.7149 1.0841 3.9854 3.8158 5.9415 9.0791 6.3254 6.8954 7.2016 8.2232 1.0577 1.0359 1.1006 1.0604 1.1020 1.0657 1.1004 1.0984 1.0969 1.0866 1.0861 1.0858 1.0887 1.0956 1.0926 1.0981 1.0924 1.0989
irintensity: 0.9153 2.3973 0.0540 8.5376 1.0334 0.1956 0.4964 0.6569 4.6026 3.1296 2.4835 5.7693 0.8200 0.4422 0.5399 0.6994 0.2387 1.5833 2.8337 3.7453 4.7563 2.8446 2.4194 1.0298 0.6567 0.1639 7.1720 0.2563 0.7426 0.3231 4.7615 6.2348 6.2225 0.4353 40.1707 17.2192 11.0110 6.1916 1.3450 5.1173 72.1522 35.3774 2.3089 6.9447 2.4725 1.4780 25.8746 2.5159 3.2853 5.5111 4.3215 1.8564 0.6325 0.3051 7.0928 96.1416 51.4325 31.1440 4.2061 2.9038 4.8593 0.1289 9.7496 0.4364 1.0105 7.2068 10.6067 0.3054 0.2483 2.6039 4.3511 2.2646 5.3164 2.8146 3.3367 0.0635 7.7821 33.6039 28.6940 7.7989 0.7430 2.9287 3.6760 6.5645 0.3144 10.6082 10.3398 5.9913 5.3575 12.4442 5.5640 3.4891 14.3092 3.2002 14.0393 2.4451 4.4639 6.3587 16.3897 51.4507 160.9131 60.3207 17.1445 59.7898 49.9426 7.9598 15.8359 28.2976 9.0829 0.2485 4.5082 8.1490 31.3687 8.7957 27.7993 33.6058 42.2222
temp: 298.150 k
press: 1.00000 atm
elementType: 8 6 6 6 6 6 6 6 6 6 6 6 6 6 6 6 6 6 6 6 6 6 6 1 1 1 1 1 1 1 1 1 1 1 1 1 1 1 1 1 1
symmnumber: 1
zpe: 867656.2 jmol-1
zpe.correction: 0.330473 hartree
zpe.thermalcorrener: 0.348795 hartree
zpe.thermalcorrenthalpy: 0.349740 hartree
zpe.thermalcorrgfe: 0.283266 hartree
zpe.sumelectzpe: -922.811799 hartree
zpe.sumelectthermal: -922.793477 hartree
zpe.sumelectthermalent: -922.792532 hartree
zpe.sumelectthermalfe: -922.859006 hartree
dipole: -1.7979 0.6676 -1.1652
dipole: 2.2441
quadrupole: -104.5391 -117.2639 -141.9574
quadrupole: -1.4589 6.2397 -0.2916
quadrupole: 16.7144 3.9896 -20.7039 -1.4589 6.2397 -0.2916
hfenergy: -923.142272 hartree
pointgroup: C01 [X(C22H18O1)]
dipole: -0.7031481 0.300273 -0.4415177 debye
polarizability: 471.7803443|1.5682181|253.7493671|12.3731772|7.29701|109.9752969 unknown
InChI: InChI=1S/C22H18O/c1-23-13-16-7-6-15-12-21-17-5-3-2-4-14(17)8-9-19(21)20-11-10-18(16)22(15)20/h2-9,12H,10-11,13H2,1H3
charge 0 multiplicity 1
41 atoms
O  -5.479974 0.192779 0.824551
C  -0.430842 1.176959 -0.095954
C  -1.236684 0.021479 -0.184088
C  -2.628508 0.326023 -0.253126
C  -1.329958 2.411903 -0.101412
C  -2.798004 1.841117 -0.186108
C  0.973577 1.046158 -0.022498
C  -0.704719 -1.308422 -0.205954
C  1.555078 -0.300741 -0.040288
C  -3.552305 -0.718657 -0.342351
C  0.710373 -1.436132 -0.131766
C  -1.672076 -2.369649 -0.297804
C  3.022963 -0.426851 0.040386
C  -3.037697 -2.068959 -0.360075
C  1.839944 2.203071 0.070753
C  -5.038844 -0.463363 -0.423984
C  3.83577 0.761226 0.132103
C  3.209585 2.069162 0.144628
C  3.691644 -1.688231 0.032768
C  5.256643 0.64731 0.211464
C  5.089973 -1.781865 0.111575
C  5.884109 -0.605542 0.201957
C  -6.905305 0.517094 0.786276
H  -1.190466 3.021649 0.811522
H  -1.104142 3.072915 -0.960224
H  -3.333842 2.232735 -1.072391
H  -3.402695 2.121665 0.694344
H  1.140799 -2.442332 -0.146133
H  -1.338498 -3.41363 -0.314497
H  -3.761523 -2.891823 -0.418986
H  1.379431 3.19726 0.082742
H  -5.281099 0.205023 -1.28302
H  -5.594052 -1.416556 -0.564305
H  3.855114 2.952718 0.215465
H  3.112237 -2.613714 -0.035092
H  5.854469 1.564059 0.280816
H  5.570698 -2.766345 0.103475
H  6.97516 -0.681098 0.263429
H  -7.530553 -0.395438 0.677672
H  -7.145374 1.212193 -0.04797
H  -7.137205 1.00435 1.746399
