program: Gaussian 09
title: 000146680
version: EM64L-G09RevD.01
frameworkgroup: C1[X(C22H14O6)]
method: RPBEPBE
basis: SDD
operation: Freq
keyword: #pfreq=noraman
keyword: PBEPBE/SDD
title: #p freq=noraman PBEPBE/SDD
converged: YES YES NO NO
title: Mulliken charges:
elementType: O O O O O O C C C C C C C C C C C C C C C C C C C C C C H H H H H H H H H H H H H H
charge: -0.523350 -0.361410 -0.171653 -0.189682 -0.317282 -0.168529 0.261496 0.242973 0.028212 0.125035 0.313553 0.302075 0.117827 -0.011180 -0.387638 -0.401158 -0.445032 -0.447167 -0.155569 -0.136863 0.143238 0.015064 0.425829 0.411857 -0.530864 -0.519570 -0.776231 -0.777050 0.268279 0.256358 0.288506 0.289057 0.277604 0.264857 0.226317 0.257366 0.258517 0.249668 0.221317 0.249374 0.406897 0.418951
chargesum: 0.00000
title: Mulliken charges with hydrogens summed into heavy atoms:
elementType: O O O O O O C C C C C C C C C C C C C C C C C C C C C C
charge: -0.116454 0.057540 -0.171653 -0.189682 -0.317282 -0.168529 0.261496 0.242973 0.028212 0.125035 0.313553 0.302075 0.117827 -0.011180 -0.119358 -0.144800 -0.156526 -0.158110 -0.155569 -0.136863 0.143238 0.015064 0.425829 0.411857 -0.253259 -0.254713 -0.034031 -0.056691
polarizability: 6.73091665e+02 -1.27777318e+01 2.77674542e+02 9.20910750e+00 1.76890613e+00 1.26115444e+02
1716.lowfreq: -2.1689 0.0002 0.0006 0.0010 3.8763 7.7497 23.3031 29.8509 43.8481
frequency: 23.2962 29.8498 43.8465 52.0424 75.7155 87.7140 105.7251 107.0662 113.1049 137.0396 161.4484 169.9676 179.4803 190.5615 232.9876 246.6706 254.4007 278.4798 289.1171 315.1104 329.6894 339.6472 359.4090 372.0907 381.6448 400.6865 412.2209 427.9090 441.1935 459.4035 471.4284 486.6325 498.1747 522.6249 530.0149 565.1161 568.8086 586.9017 596.1752 602.4177 640.9524 645.1145 670.4243 690.3624 705.7637 716.3336 730.8359 753.8787 778.9958 800.5230 820.5003 854.9689 863.2257 869.7758 880.4972 891.9243 899.5247 913.8970 916.3523 982.9604 985.4950 986.0474 993.1074 1023.7372 1044.4536 1046.5320 1050.3484 1070.0057 1081.2195 1133.9262 1153.0656 1180.6566 1190.2792 1214.9977 1227.4083 1237.9519 1254.1872 1262.4363 1283.3226 1293.4034 1336.6286 1345.4386 1356.2147 1364.0278 1366.6860 1391.9368 1398.2276 1398.8294 1434.1386 1440.0035 1441.5584 1445.9165 1451.5639 1457.4893 1460.2602 1482.9089 1519.7193 1521.6936 1538.2652 1561.5973 1565.8823 1569.3984 1595.0737 1600.9112 1644.8500 1647.1101 2210.5865 2942.2550 2989.7264 2990.6112 3065.7689 3067.7002 3106.4004 3112.2430 3138.5438 3139.8130 3153.8935 3154.2434 3170.2877 3173.0925
redmass: 5.0908 9.5474 5.2086 8.7188 6.8739 4.7295 1.2503 1.1917 3.8823 5.3357 3.7638 6.1434 7.6631 5.9007 5.0951 4.9196 4.7112 3.3517 3.8731 6.6744 6.1699 6.0234 7.1686 5.3139 7.0936 4.3537 8.3823 9.5602 10.4849 7.4546 4.4921 7.0524 6.6321 5.5816 5.7677 5.4739 6.4691 5.4599 6.9454 6.6642 4.4238 4.5676 4.2461 4.1485 5.1277 5.8512 5.5318 4.9053 4.9470 3.8027 3.2106 5.7280 1.7750 1.4091 1.6272 3.7275 1.5081 3.7836 1.6403 1.6642 1.7324 2.0315 1.4189 3.0824 1.6218 2.5162 1.5881 3.2863 1.0762 2.5475 1.6196 2.5284 2.4829 1.8692 2.0964 3.0943 2.7440 2.7333 2.2220 3.2127 2.4867 2.5782 5.2365 3.9628 4.9483 4.5872 1.3062 1.2947 4.1845 1.0475 4.1377 1.0455 1.1138 1.0981 2.8150 2.2807 9.1419 6.9375 8.4123 3.7463 7.5864 7.7192 4.4808 5.6140 4.6378 7.1365 1.0862 1.0713 1.0368 1.0374 1.0948 1.0958 1.1009 1.1009 1.0925 1.0889 1.0928 1.0882 1.0954 1.0960
irintensity: 0.7885 1.1135 0.7558 1.9354 11.2410 0.3659 0.3741 0.3955 0.6549 1.4049 0.9569 0.6283 0.0526 0.0651 0.0945 0.7096 0.5066 2.4669 0.8693 4.0791 3.2212 5.1483 1.9146 4.0797 13.4916 0.9774 34.6553 52.2135 0.3613 2.7575 2.1740 0.6692 1.9672 0.3007 24.0923 0.7114 10.1170 0.5534 4.4385 1.0833 2.0248 2.2081 3.0138 6.8554 5.6266 9.5927 3.9860 13.8808 2.1554 20.3524 9.1104 4.9379 24.7818 152.7579 23.8014 13.6895 12.7104 15.1738 8.4139 30.6788 64.3303 26.2053 0.5181 25.2384 10.4538 31.8011 10.5054 4.5515 121.4180 21.5600 27.5110 51.4518 5.7633 50.0697 4.2962 10.2574 405.6140 26.6281 128.6358 47.6929 14.3649 83.8517 52.8821 92.9302 21.9976 58.1311 88.9627 15.6669 18.7672 16.3512 106.6230 14.3687 8.0721 5.0299 188.4633 54.5502 358.5493 425.2113 195.7212 59.7664 7.4555 114.6453 4.5910 73.6606 6.9548 38.5448 345.2280 576.9365 13.7218 3.7268 4.8428 9.2340 18.1574 24.1395 22.0677 4.1879 9.4730 1.9046 3.6859 1.7661
temp: 298.150 k
press: 1.00000 atm
elementType: 8 8 8 8 8 8 6 6 6 6 6 6 6 6 6 6 6 6 6 6 6 6 6 6 6 6 6 6 1 1 1 1 1 1 1 1 1 1 1 1 1 1
symmnumber: 1
zpe: 789156.7 jmol-1
zpe.correction: 0.300574 hartree
zpe.thermalcorrener: 0.323817 hartree
zpe.thermalcorrenthalpy: 0.324761 hartree
zpe.thermalcorrgfe: 0.247326 hartree
zpe.sumelectzpe: -1296.185890 hartree
zpe.sumelectthermal: -1296.162646 hartree
zpe.sumelectthermalent: -1296.161702 hartree
zpe.sumelectthermalfe: -1296.239138 hartree
dipole: 4.6633 -1.7214 -0.8845
dipole: 5.0489
quadrupole: -133.1137 -176.3888 -163.7762
quadrupole: 6.1004 -2.9838 -3.2608
quadrupole: 24.6459 -18.6292 -6.0166 6.1004 -2.9838 -3.2608
hfenergy: -1296.4864634 hartree
pointgroup: C01 [X(C22H14O6)]
dipole: 1.8338048 0.3600931 -0.6732862 debye
polarizability: 673.0246978|-9.4917663|126.2714963|-13.6936721|-4.8692718|277.5854564 unknown
InChI: InChI=1S/C22H14O6/c1-9-7-15(23)17-13(19(9)25)5-3-11(21(17)27)12-4-6-14-18(22(12)28)16(24)8-10(2)20(14)26/h3-8,27-28H,1-2H3
charge 0 multiplicity 1
42 atoms
O  1.14633 0.627148 1.792181
O  -1.082719 -0.584986 1.837466
O  5.632574 -0.703663 -2.105199
O  -5.565075 0.713166 -2.073905
O  3.422938 0.847146 2.675276
O  -3.574793 -1.049713 2.719457
C  0.740575 -0.018003 -0.528764
C  -0.74251 0.146763 -0.491967
C  3.056237 0.154248 0.399009
C  -3.023778 -0.184763 0.483704
C  3.618391 -0.242291 -0.847608
C  -3.59404 0.247624 -0.75077
C  1.639503 0.250186 0.556931
C  -1.592188 -0.195901 0.63177
C  1.35291 -0.43755 -1.746399
C  -1.37269 0.591762 -1.688198
C  2.749182 -0.549645 -1.914022
C  -2.765076 0.654239 -1.820994
C  5.095996 -0.345166 -1.007262
C  -5.078766 0.323922 -0.962318
C  3.932224 0.473561 1.532083
C  -3.946809 -0.596548 1.590074
C  5.962859 -0.011454 0.181023
C  -5.977287 -0.060198 0.164047
C  5.381931 0.372271 1.368747
C  -5.411194 -0.47494 1.340499
C  7.450482 -0.121254 -0.010201
C  -7.46376 0.031409 -0.068968
H  0.702104 -0.711602 -2.582052
H  -0.744277 0.921979 -2.521929
H  3.177032 -0.881063 -2.864796
H  -3.238651 1.012517 -2.739271
H  5.985089 0.622159 2.248133
H  -6.03235 -0.771862 2.194405
H  8.000932 0.12923 0.9103
H  7.784474 0.544646 -0.827303
H  7.723226 -1.142698 -0.333335
H  -7.748896 1.060237 -0.355145
H  -8.031796 -0.26587 0.827381
H  -7.763866 -0.610782 -0.917211
H  1.994614 0.817793 2.429952
H  -0.164382 -0.165753 2.003677
