program: Gaussian 09
title: 000146665
version: EM64L-G09RevD.01
frameworkgroup: C1[X(C21H20O8)]
method: RPBEPBE
basis: SDD
operation: Freq
keyword: #pfreq=noraman
keyword: PBEPBE/SDD
title: #p freq=noraman PBEPBE/SDD
converged: YES YES NO NO
title: Mulliken charges:
elementType: O O O O O O O O C C C C C C C C C C C C C C C C C C C C C H H H H H H H H H H H H H H H H H H H H
charge: -0.233558 -0.263864 -0.258559 -0.185339 -0.193284 -0.290376 -0.300655 -0.308593 -0.374554 -0.370058 0.347315 0.608097 0.160568 0.157235 -0.497425 0.249153 0.170012 -0.494479 -0.637644 -0.547953 0.202244 0.240486 0.279015 -0.787363 -0.001061 -0.204916 -0.524404 -0.527697 -0.524791 0.307560 0.296717 0.282013 0.278733 0.272439 0.287508 0.282706 0.236360 0.254971 0.244244 0.235658 0.230110 0.263215 0.214966 0.222402 0.252926 0.232429 0.228562 0.232003 0.256925
chargesum: 0.00000
title: Mulliken charges with hydrogens summed into heavy atoms:
elementType: O O O O O O O O C C C C C C C C C C C C C C C C C C C C C
charge: -0.233558 -0.263864 -0.258559 -0.185339 -0.193284 -0.290376 -0.300655 -0.308593 -0.066994 -0.073341 0.347315 0.608097 0.160568 0.157235 -0.215412 0.249153 0.170012 -0.206971 -0.358910 -0.275514 0.202244 0.240486 0.279015 -0.013325 -0.001061 0.274986 0.183887 0.180060 0.192700
polarizability: 3.09539565e+02 1.12408202e+01 2.78167290e+02 -1.26573787e+01 -3.28081053e-01 1.94519120e+02
1716.lowfreq: -6.8854 -2.0441 -0.0008 -0.0006 -0.0004 5.7021 15.0600 26.7126 30.3045
frequency: 14.2900 26.6863 30.2128 46.5955 55.0070 60.0454 64.3867 74.5563 78.2118 89.0122 92.8910 115.0452 132.5529 138.8185 140.1702 155.2643 160.3433 163.9705 179.9479 199.6941 214.1235 215.1174 224.2728 240.8191 251.5151 266.2575 283.0285 294.8948 324.3394 350.1309 356.6716 370.2123 401.0029 428.2072 434.3702 456.4001 471.2822 487.1179 513.9109 540.8244 553.3770 566.6102 593.4209 612.5775 620.1476 641.9428 653.0465 668.2218 678.8145 680.8926 709.3893 742.4432 768.1863 770.0665 775.9806 819.0561 838.2363 855.9353 860.7416 866.4883 880.3739 886.9085 895.2181 902.2957 927.5408 940.5670 956.7318 974.0534 999.7561 1016.2897 1025.5696 1037.1247 1067.9416 1083.1985 1095.8106 1110.7539 1112.0015 1113.1435 1117.1395 1123.8837 1133.8102 1149.9981 1151.6622 1154.4480 1158.3339 1162.2379 1186.8292 1208.3832 1216.3390 1226.5072 1231.5677 1272.8740 1279.8075 1304.7772 1312.1809 1360.0358 1361.3485 1366.2763 1397.2493 1402.2717 1417.2331 1428.1928 1434.8363 1441.3038 1442.0593 1454.7352 1455.1120 1458.4799 1460.1370 1465.2020 1469.6313 1475.6537 1484.2477 1485.9068 1487.1579 1570.1834 1604.8978 1619.3541 1629.0282 1645.2943 1657.7618 2974.2119 2974.7877 2975.5063 2979.4971 2981.7138 2990.4149 3004.7946 3068.3676 3072.9627 3080.1365 3082.3685 3109.3804 3123.0268 3123.6655 3127.2102 3127.6390 3143.7880 3163.3245 3179.7775 3198.6844
redmass: 4.8402 6.1388 5.1076 5.5524 3.6721 3.4509 2.9937 3.4180 5.2236 2.6689 3.1353 6.0294 4.0264 1.3494 1.3082 1.5736 1.1411 1.3843 9.0061 4.0955 5.1853 6.3070 5.1451 5.1094 5.7989 5.3650 6.0654 5.6893 4.5974 7.5975 8.6426 5.7218 4.5312 4.5175 6.8731 4.3861 5.2669 4.3096 5.1407 5.8663 5.8176 6.2754 5.1352 5.6130 5.1846 5.4965 6.2800 4.5274 7.2401 8.7263 3.9714 4.7824 3.8903 6.3396 6.8715 4.6565 6.4529 3.5112 1.5335 5.4589 1.7119 1.8818 1.5174 3.4965 3.6807 8.7216 2.4341 5.1333 4.6474 4.1254 2.2214 5.5136 1.4848 3.5702 4.7984 1.2985 1.2435 1.2404 2.7169 1.2106 2.1263 1.4193 1.6597 1.4627 1.4827 2.1864 2.0016 1.3094 1.5356 1.3923 1.8674 1.7629 8.9316 2.8139 1.9498 3.2220 1.6936 1.2590 4.6264 1.7389 1.2778 7.4204 1.2432 1.0886 1.5706 1.2780 1.0588 1.0887 1.0931 1.7875 2.1981 1.0579 1.0557 1.4483 1.0599 7.3266 6.8718 8.9965 9.5376 8.3795 11.7488 1.0315 1.0795 1.0336 1.0297 1.0390 1.0814 1.0598 1.0957 1.1034 1.1050 1.0996 1.1118 1.1034 1.1029 1.1003 1.1044 1.0913 1.0926 1.0927 1.0941
irintensity: 0.2883 1.3399 0.4120 0.8237 7.8163 5.4854 2.1007 4.1465 11.8755 0.4325 10.4870 2.8330 1.4804 0.5874 0.1529 1.3289 0.5195 1.3863 2.8472 6.1633 2.4373 0.2369 3.4967 13.6445 1.3782 3.2839 8.5906 5.2321 2.5626 1.3431 2.6516 3.2355 3.2542 6.8442 1.5669 16.8223 4.9197 1.5956 1.6572 20.2136 2.6327 4.8523 14.7290 5.8564 8.2651 6.4534 10.7602 6.6541 2.7408 1.2545 1.8372 1.8673 7.0349 13.4393 9.9302 2.8587 29.4955 3.6352 20.3464 2.8415 32.4462 13.0121 2.7241 14.0638 87.6476 80.3553 3.7196 200.3381 33.6254 54.3054 5.7068 145.5589 6.9854 9.1028 366.9276 29.4119 12.9534 7.0468 132.9054 57.2310 141.2085 4.3225 18.4841 6.2031 17.9771 6.5876 54.2628 9.9987 19.7228 57.4624 92.9549 17.8180 69.5217 150.2032 47.9381 5.3468 3.9097 94.4980 92.4398 46.2390 3.4489 7.1277 27.2024 27.6667 19.3250 43.7628 30.6197 26.0275 2.1480 36.2530 215.6193 3.0160 23.4758 68.9923 25.3736 77.2401 44.8433 14.3247 37.5467 135.9492 261.7170 57.6159 3.7965 96.2530 55.1093 1.5444 8.2788 127.9343 3.1247 25.8913 19.6067 31.5050 29.1708 22.3750 23.2994 13.0329 14.9993 2.9025 0.1591 1.3361 0.7631
temp: 298.150 k
press: 1.00000 atm
elementType: 8 8 8 8 8 8 8 8 6 6 6 6 6 6 6 6 6 6 6 6 6 6 6 6 6 6 6 6 6 1 1 1 1 1 1 1 1 1 1 1 1 1 1 1 1 1 1 1 1
symmnumber: 1
zpe: 967711.2 jmol-1
zpe.correction: 0.368582 hartree
zpe.thermalcorrener: 0.396954 hartree
zpe.thermalcorrenthalpy: 0.397899 hartree
zpe.thermalcorrgfe: 0.307319 hartree
zpe.sumelectzpe: -1411.827456 hartree
zpe.sumelectthermal: -1411.799083 hartree
zpe.sumelectthermalent: -1411.798139 hartree
zpe.sumelectthermalfe: -1411.888719 hartree
dipole: 3.1856 -5.8734 1.6609
dipole: 6.8850
quadrupole: -154.5673 -170.2094 -166.8972
quadrupole: 12.7478 1.1333 7.3194
quadrupole: 9.3240 -6.3181 -3.0059 12.7478 1.1333 7.3194
hfenergy: -1412.1960374 hartree
pointgroup: C01 [X(C21H20O8)]
dipole: 1.2203548 -2.2116285 0.9782082 debye
polarizability: 308.8677509|7.4671139|275.3045934|-18.7747473|-13.5862449|198.0536299 unknown
InChI: InChI=1S/C21H20O8/c1-10(22)18-19(11-5-16(24-2)20(26-4)17(6-11)25-3)12-7-14-15(28-9-27-14)8-13(12)29-21(18)23/h5-8,18-19H,9H2,1-4H3
charge 0 multiplicity 1
49 atoms
O  -3.126539 2.204141 -0.011454
O  -3.091828 -3.372606 0.082334
O  -5.141383 -2.226809 0.587661
O  -2.204952 4.283258 -0.016909
O  0.705666 3.251856 -1.824006
O  2.620396 -0.969261 2.609505
O  3.903589 -0.616533 -2.166061
O  4.601009 -1.383587 0.536216
C  -0.553112 0.989706 -0.654022
C  -0.619295 2.38872 0.035275
C  -1.762752 0.143612 -0.26021
C  0.792699 0.32348 -0.353201
C  -2.989035 0.782574 0.034589
C  -2.005567 3.055444 -0.009101
C  -1.721927 -1.280428 -0.256033
C  0.402351 3.374416 -0.612381
C  -2.894327 -1.967829 0.052358
C  -4.18704 0.092347 0.345005
C  1.733114 0.11345 -1.386443
C  1.108466 -0.095311 0.962301
C  -4.102174 -1.298042 0.347552
C  2.360294 -0.677869 1.259026
C  2.980059 -0.485235 -1.105384
C  0.974509 4.450949 0.28178
C  3.32554 -0.852455 0.225714
C  -4.474932 -3.559317 0.594626
C  3.109721 -2.3301 2.927224
C  4.342515 -2.001479 -2.458596
C  5.700984 -0.392129 0.415838
H  -0.595623 1.181096 -1.745791
H  -0.370261 2.282426 1.111317
H  -0.794283 -1.810214 -0.483392
H  1.524226 0.424177 -2.414491
H  0.390654 0.007886 1.783298
H  -5.107769 0.638005 0.557533
H  0.147578 5.053815 0.700566
H  1.515156 3.991661 1.131849
H  1.659445 5.099339 -0.28516
H  -5.020616 -4.234534 -0.082193
H  -4.428906 -3.93038 1.635437
H  3.256644 -2.330988 4.017891
H  4.056443 -2.540685 2.403831
H  2.344623 -3.081087 2.650826
H  3.48202 -2.605088 -2.804403
H  4.799201 -2.468866 -1.568403
H  5.081008 -1.905699 -3.268819
H  6.622246 -0.945076 0.654559
H  5.55062 0.427774 1.141786
H  5.745644 0.010372 -0.611845
