program: Gaussian 09
title: 000146617
version: EM64L-G09RevD.01
frameworkgroup: C1[X(C16H15NO3S)]
method: RPBEPBE
basis: SDD
operation: Freq
keyword: #p
keyword: freq=noraman
keyword: PBEPBE/SDD
title: #p freq=noraman PBEPBE/SDD
converged: YES YES NO NO
title: Mulliken charges:
elementType: S O O O N C C C C C C C C C C C C C C C C H H H H H H H H H H H H H H H
charge: 0.239713 -0.228850 -0.250637 -0.169311 -0.170688 0.461602 -0.259274 -0.342415 -0.373313 -0.248162 -0.160454 -0.175256 0.227076 -0.183036 -0.274936 -0.774294 -0.229314 -0.209068 -0.240757 0.279264 -0.748281 0.309884 0.251843 0.256560 0.262791 0.264368 0.247872 0.262027 0.254840 0.249053 0.229608 0.229140 0.230047 0.258155 0.261971 0.262232
chargesum: 0.00000
title: Mulliken charges with hydrogens summed into heavy atoms:
elementType: S O O O N C C C C C C C C C C C C C C C C
charge: 0.239713 -0.228850 -0.250637 -0.169311 -0.170688 0.461602 -0.259274 -0.032531 -0.121470 0.008398 0.102337 -0.175256 0.227076 0.081332 -0.027064 -0.008375 0.000294 0.020072 -0.010710 0.279264 0.034078
polarizability: 3.14652233e+02 -1.94925906e+01 2.05344654e+02 1.76204597e+01 -2.90691933e+00 1.36762378e+02
1716.lowfreq: 0.0013 0.0019 0.0020 3.6960 5.7707 9.8859 15.5034 26.2077 27.8336
frequency: 14.3405 26.1041 27.7815 48.6184 55.0328 58.0460 73.5300 79.8628 87.3568 130.1244 143.9667 173.8651 177.2156 226.5333 241.8121 271.2227 314.2561 326.5861 352.2457 379.9227 392.2954 401.8263 407.7433 419.9208 463.7399 480.4373 522.4918 530.8888 552.6100 560.9104 584.4860 611.1439 628.3558 672.1710 681.4993 693.6499 711.7359 730.8421 747.5181 754.8568 829.7079 843.4832 849.6972 897.6060 910.9075 958.4096 968.0401 972.1190 980.2125 983.9865 990.8688 991.4074 1000.4762 1009.1407 1016.6106 1034.4901 1039.9524 1067.5341 1077.6883 1086.5689 1121.7967 1140.5676 1171.3254 1186.3512 1190.2589 1209.6207 1292.9846 1306.6467 1318.7081 1364.0223 1376.7452 1382.3880 1385.3501 1407.4442 1428.1614 1450.3152 1451.7172 1454.8528 1460.7364 1467.6247 1472.9250 1566.8078 1586.2256 1590.2442 1598.3416 1605.2832 1716.2526 3000.6329 3008.0418 3091.6914 3101.4950 3126.8301 3134.3440 3136.7942 3139.2297 3147.0197 3151.3606 3153.5797 3155.5257 3167.9737 3181.2978 3209.5874
redmass: 6.5130 4.4994 4.6493 4.0210 2.7898 1.9054 2.7451 3.7064 4.3389 6.3650 6.1839 1.1844 3.0946 5.4149 5.9372 7.6214 6.0496 4.8959 3.8999 6.6114 5.9750 3.0099 3.0153 6.6768 5.4907 3.8437 3.6857 3.8726 3.5238 3.6007 4.3049 6.4581 7.0453 6.7681 7.1859 2.2796 4.0608 6.5177 1.5196 6.8158 1.3602 1.2572 1.3761 5.2373 1.3698 1.3251 4.0094 1.3870 1.3642 5.7407 1.5247 2.4251 3.8043 1.9490 3.3406 1.6065 1.6292 2.4023 1.5942 2.7259 1.4642 2.3607 1.0509 1.1201 1.2985 2.6877 1.4421 1.3470 3.4869 6.2824 8.6186 1.2276 1.2109 3.5716 2.1828 1.0620 1.0655 1.0518 2.0569 1.0581 2.3433 7.6063 6.3277 5.9851 6.2405 8.1322 11.4954 1.0377 1.0378 1.0967 1.0948 1.0845 1.0880 1.1004 1.1024 1.0926 1.0898 1.0912 1.0962 1.1016 1.0948 1.0944
irintensity: 1.9690 0.3146 0.3742 0.0461 0.1307 3.6618 2.4268 0.5625 3.0371 1.4179 0.6501 0.4315 0.8745 0.7226 10.7947 3.3969 3.7343 2.7424 5.2575 3.6919 0.8338 1.0071 1.6252 2.5179 23.3868 9.8335 4.2672 38.1276 0.5962 0.3761 25.5363 0.4904 0.5764 14.1577 5.0979 35.3760 2.0044 14.7660 75.8912 85.2404 23.6307 3.1458 42.2023 19.5351 1.7643 0.6514 60.2069 0.4762 1.4581 5.3131 0.4990 3.5320 13.0293 33.5892 20.0345 5.6989 9.8781 14.9572 6.7395 0.1333 27.2380 181.0580 0.1134 3.0021 1.9304 27.4900 85.2845 12.4514 358.4261 17.2622 2.4703 47.1044 53.1007 18.8870 8.7097 14.4603 28.9690 21.6245 64.2722 23.6462 174.4542 2.3826 2.1102 40.3837 23.2017 158.6833 138.7773 4.9716 0.1658 8.1004 4.4358 1.2869 3.7705 7.3376 3.5264 14.1153 4.2663 4.0091 24.3737 23.7928 4.3648 6.3139
temp: 298.150 k
press: 1.00000 atm
elementType: 16 8 8 8 7 6 6 6 6 6 6 6 6 6 6 6 6 6 6 6 6 1 1 1 1 1 1 1 1 1 1 1 1 1 1 1
symmnumber: 1
zpe: 711033.7 jmol-1
zpe.correction: 0.270818 hartree
zpe.thermalcorrener: 0.291421 hartree
zpe.thermalcorrenthalpy: 0.292365 hartree
zpe.thermalcorrgfe: 0.217685 hartree
zpe.sumelectzpe: -1295.647759 hartree
zpe.sumelectthermal: -1295.627157 hartree
zpe.sumelectthermalent: -1295.626213 hartree
zpe.sumelectthermalfe: -1295.700893 hartree
dipole: 1.3906 5.3530 -2.4822
dipole: 6.0622
quadrupole: -112.2590 -124.6817 -132.9615
quadrupole: 9.3988 -6.7043 -3.6966
quadrupole: 11.0418 -1.3810 -9.6608 9.3988 -6.7043 -3.6966
hfenergy: -1295.9185776 hartree
pointgroup: C01 [X(C16H15N1O3S1)]
dipole: 0.5333047 2.1126761 -0.9698674 debye
polarizability: 314.0562815|-16.8465265|204.5046959|23.7772781|-3.4331014|138.1982878 unknown
InChI: InChI=1S/C16H15NO3S/c1-12(18)17(20-13(2)19)14-8-10-16(11-9-14)21-15-6-4-3-5-7-15/h3-11H,1-2H3
charge 0 multiplicity 1
36 atoms
S  -2.875679 -1.981305 -0.561281
O  3.311336 0.907852 -0.786864
O  3.928018 -2.151623 1.021083
O  2.979797 1.991669 1.294255
N  2.998682 -0.351635 -0.118654
C  1.619969 -0.737585 -0.204616
C  -1.122232 -1.441456 -0.396962
C  1.113989 -1.838186 0.539911
C  0.746659 -0.00538 -1.055394
C  -0.252884 -2.174019 0.44099
C  -0.611066 -0.361672 -1.152742
C  -3.804554 -0.433157 -0.163403
C  4.091661 -1.031024 0.461426
C  -3.332507 0.509691 0.77965
C  -5.058198 -0.247632 -0.794383
C  5.441565 -0.33936 0.363096
C  -4.115886 1.646432 1.080735
C  -5.842006 0.884569 -0.473917
C  -5.373232 1.837329 0.460089
C  3.21098 2.073355 0.083554
C  3.431841 3.302479 -0.762755
H  1.781995 -2.413294 1.180579
H  1.13194 0.819368 -1.659219
H  -0.642344 -3.008884 1.032416
H  -1.272909 0.199926 -1.819583
H  -2.366744 0.358494 1.272753
H  -5.413754 -0.97509 -1.532308
H  6.201323 -1.048675 0.722336
H  5.469484 0.560599 1.004058
H  5.673382 -0.032215 -0.670369
H  -3.746373 2.375664 1.810518
H  -6.812668 1.023311 -0.963074
H  -5.979619 2.717094 0.701507
H  4.025199 4.037735 -0.196438
H  3.930985 3.054548 -1.7112
H  2.45295 3.762976 -0.990095
