program: Gaussian 09
title: 000146613
version: EM64L-G09RevD.01
frameworkgroup: C1[X(C21H22O6)]
method: RPBEPBE
basis: SDD
operation: Freq
keyword: #pfreq=noraman
keyword: PBEPBE/SDD
title: #p freq=noraman PBEPBE/SDD
converged: YES YES NO NO
title: Mulliken charges:
elementType: O O O O O O C C C C C C C C C C C C C C C C C C C C C H H H H H H H H H H H H H H H H H H H H H H
charge: -0.279755 -0.269805 -0.266533 -0.274845 -0.238959 -0.261229 -0.476291 0.410464 0.237868 0.698290 0.132208 0.145401 -0.520336 0.176027 -0.825099 -0.511155 0.204575 -0.696246 -0.557312 -0.778810 0.279844 0.245384 0.018992 -0.203432 -0.536182 -0.535588 -0.519339 0.227643 0.260442 0.217857 0.252122 0.223999 0.277403 0.244182 0.255059 0.224637 0.243759 0.239665 0.236283 0.235894 0.226300 0.224302 0.242476 0.215991 0.219060 0.246756 0.246664 0.212909 0.228457
chargesum: 0.00000
title: Mulliken charges with hydrogens summed into heavy atoms:
elementType: O O O O O O C C C C C C C C C C C C C C C C C C C C C
charge: -0.279755 -0.269805 -0.266533 -0.274845 -0.238959 -0.261229 -0.248648 0.410464 0.237868 0.698290 0.132208 0.145401 -0.259894 0.176027 -0.131120 -0.233752 0.204575 -0.452064 -0.302253 -0.070748 0.279844 0.245384 0.018992 0.268746 0.156897 0.146218 0.168691
polarizability: 2.87679243e+02 3.08422513e+00 2.55219951e+02 2.62381193e+01 1.08135530e+01 2.26377416e+02
1716.lowfreq: -70.2026 -5.4831 -3.9468 0.0007 0.0008 0.0009 5.5888 11.7996 19.3949
frequency: -70.1915 11.1067 19.2832 28.3682 56.4184 60.6087 70.6795 89.9840 91.7173 104.9419 105.7378 118.8147 126.7108 150.0472 155.5242 178.3460 186.3110 191.4050 196.4232 216.2693 230.9896 261.9106 269.4035 276.9358 286.3028 316.8760 322.4175 344.1053 349.8027 352.2027 357.1394 376.3487 411.6510 436.4181 466.0417 486.0275 514.6486 520.2894 539.0517 568.2342 588.2028 611.5645 631.6044 646.8682 671.7101 680.6415 689.2186 707.3892 710.7935 748.8454 764.3880 774.3622 789.3444 830.7804 832.0860 847.9777 848.3613 861.3458 868.9054 881.9468 908.7173 950.0465 952.5067 977.0680 995.1055 1009.7290 1028.4456 1038.3899 1049.1481 1065.1553 1088.2649 1106.5178 1110.5462 1113.3478 1117.7139 1118.9088 1131.3449 1143.5328 1151.5862 1155.4705 1157.1796 1157.9830 1175.2511 1202.4518 1208.3748 1228.9517 1231.0118 1264.7998 1269.4573 1300.7876 1317.6777 1363.3350 1385.7127 1391.9861 1408.1523 1413.0823 1417.8577 1420.8499 1429.3583 1441.4901 1447.6491 1454.5982 1457.0833 1462.6474 1465.5434 1466.5085 1468.0124 1468.9163 1471.3801 1474.1582 1477.4897 1479.5769 1488.5842 1490.9156 1590.6354 1595.0432 1625.6093 1630.9944 1709.3931 2932.9015 2954.8063 2961.8218 2962.7335 2971.5165 2988.1872 3009.5997 3031.7420 3041.3873 3052.2496 3061.1460 3072.2521 3086.0757 3100.3877 3119.8603 3122.1986 3123.2866 3124.6820 3141.0119 3156.7018 3164.5177 3194.0822
redmass: 2.3364 4.6498 5.3863 5.4372 3.2387 2.8432 3.0836 3.1929 1.1171 3.1742 3.4321 1.1081 4.2337 2.3916 1.5850 5.5418 3.5608 2.6635 2.1100 2.7688 3.6559 1.9871 3.5322 2.5896 2.3934 3.2615 4.4243 4.1984 4.5509 4.3668 5.7376 4.6536 4.6245 3.8925 4.6882 5.9864 6.3706 4.6402 4.7227 6.4236 4.4936 5.3791 5.5371 4.9585 5.8473 7.8656 6.2087 3.8850 5.7378 3.9257 4.1788 4.3201 4.5806 2.0272 1.8847 9.2299 1.4791 1.8195 5.0989 2.1590 3.2711 4.5205 8.8401 5.6216 1.7035 3.8274 3.2717 1.6475 1.5020 1.4570 7.1161 1.2578 1.2594 1.2586 2.8249 1.0364 2.4305 2.2477 1.4294 1.4853 3.4136 1.4557 3.7962 1.6027 2.1640 1.4704 1.6046 1.5101 7.2157 5.7830 2.6670 1.2962 7.0330 1.3568 1.2400 1.8622 4.1844 1.2206 7.3616 1.2063 1.4550 1.0453 1.0888 1.0473 1.0649 1.0502 1.0768 1.4560 1.8270 1.0930 1.0542 1.0747 1.2792 2.3042 6.5297 7.3772 8.9359 8.9322 7.5137 1.0825 1.0332 1.0412 1.0326 1.0319 1.0390 1.0533 1.0948 1.1036 1.1041 1.0976 1.1018 1.1189 1.0957 1.1028 1.0989 1.0999 1.0955 1.0901 1.0902 1.0928 1.0936
irintensity: 13.1876 0.2511 0.1808 0.4543 2.6750 8.8895 1.0853 2.3198 0.5590 2.1671 2.0034 0.8061 1.0605 0.9642 1.4877 2.8121 2.3404 0.8458 0.6740 2.1821 8.8824 0.7142 0.4419 1.3552 1.7507 0.8157 0.7516 6.9525 0.6453 2.2802 0.7594 4.3933 4.5293 1.3558 2.1002 3.5312 3.4298 1.4155 1.9686 9.4475 0.2244 15.2475 2.4333 19.6649 13.1417 1.8591 3.8277 4.3036 11.1488 10.1203 8.2364 0.7861 18.2249 0.7902 0.5055 30.2376 18.2603 46.8687 9.0829 27.8470 9.0327 7.3958 31.3838 160.1809 19.2202 0.7356 28.7933 5.4703 0.9650 4.0609 288.9029 17.3034 0.0865 0.1309 41.9152 0.0061 58.6313 146.9352 16.4120 40.3104 147.8153 20.8859 89.9566 55.8361 63.2524 53.6570 39.9446 15.2854 62.5867 109.3784 29.6273 0.9790 1.5505 21.6324 21.7746 112.0498 78.4497 13.5546 0.1744 6.4258 62.1448 6.1895 1.7276 9.9715 26.8185 17.1295 17.4997 120.7258 177.6568 51.9160 11.1662 23.7979 27.0385 69.5273 56.1947 89.9767 15.2610 5.6303 36.8867 28.8697 69.0387 40.6539 56.1328 79.5253 30.2851 143.3542 20.9546 47.7711 39.6034 15.2987 34.0440 33.5377 28.4093 25.1641 29.9511 27.4294 23.9151 8.5343 2.1660 2.1505 0.2550
temp: 298.150 k
press: 1.00000 atm
elementType: 8 8 8 8 8 8 6 6 6 6 6 6 6 6 6 6 6 6 6 6 6 6 6 6 6 6 6 1 1 1 1 1 1 1 1 1 1 1 1 1 1 1 1 1 1 1 1 1 1
symmnumber: 1
zpe: 1006819.1 jmol-1
zpe.correction: 0.383477 hartree
zpe.thermalcorrener: 0.409576 hartree
zpe.thermalcorrenthalpy: 0.410520 hartree
zpe.thermalcorrgfe: 0.325373 hartree
zpe.sumelectzpe: -1262.703762 hartree
zpe.sumelectthermal: -1262.677664 hartree
zpe.sumelectthermalent: -1262.676719 hartree
zpe.sumelectthermalfe: -1262.761867 hartree
dipole: 1.8045 -0.0274 -0.6323
dipole: 1.9123
quadrupole: -173.9457 -141.7697 -137.8389
quadrupole: -2.5699 3.6837 0.6721
quadrupole: -22.7610 9.4151 13.3458 -2.5699 3.6837 0.6721
hfenergy: -1263.0872395 hartree
pointgroup: C01 [X(C21H22O6)]
dipole: -0.7060573 -0.0287532 -0.2582268 debye
polarizability: 288.218587|2.6906213|253.8441669|-25.160925|-13.4070633|227.2138552 unknown
InChI: InChI=1S/C21H22O6/c1-11-12(2)27-15-9-17-16(25-10-26-17)8-14(15)20(11)13-6-18(22-3)21(24-5)19(7-13)23-4/h6-9,20H,10H2,1-5H3
charge 0 multiplicity 1
49 atoms
O  -2.406402 -2.230811 0.63588
O  -3.321985 3.076018 -0.820299
O  -4.852654 2.015162 0.703407
O  2.720582 0.006018 2.659076
O  4.037432 1.308759 -1.743567
O  4.569239 1.10513 0.895762
C  -0.389352 -1.06489 -1.171726
C  -1.611774 -0.291919 -0.675794
C  -0.498693 -2.563806 -0.867255
C  0.920695 -0.471244 -0.608514
C  -2.534984 -0.890958 0.211767
C  -1.43114 -3.059438 -0.005069
C  -1.818337 1.060367 -1.076831
C  -2.923049 1.73599 -0.565014
C  0.518357 -3.426195 -1.584278
C  -3.66179 -0.203126 0.740508
C  -3.823369 1.11695 0.330047
C  1.860051 0.124655 -1.476701
C  1.175291 -0.520134 0.779965
C  -1.658135 -4.47762 0.446822
C  2.372434 0.024751 1.297455
C  3.057469 0.684104 -0.960351
C  3.330099 0.636263 0.435866
C  -4.559895 3.280852 -0.024723
C  1.802088 -0.671184 3.578149
C  3.816986 1.343137 -3.189971
C  4.523789 2.258422 1.818958
H  -0.329709 -0.950491 -2.276419
H  -1.111787 1.554003 -1.749966
H  0.46849 -4.489348 -1.302032
H  1.544401 -3.065906 -1.378249
H  0.372142 -3.363927 -2.682083
H  -4.35236 -0.705177 1.420225
H  1.650514 0.152261 -2.551048
H  0.439624 -0.990299 1.439115
H  -0.882494 -5.160321 0.070341
H  -2.644415 -4.841524 0.103576
H  -1.661206 -4.526645 1.551356
H  -4.386299 4.084396 0.711941
H  -5.397493 3.50009 -0.709709
H  1.677089 -1.736682 3.305552
H  0.812196 -0.175526 3.599087
H  2.278298 -0.593653 4.566723
H  2.905677 1.91778 -3.449325
H  3.743281 0.321985 -3.61287
H  4.702565 1.850339 -3.600289
H  3.990941 1.994891 2.749119
H  4.038558 3.124808 1.329534
H  5.577431 2.493193 2.03425
