program: Gaussian 09
title: 000146593
version: EM64L-G09RevD.01
frameworkgroup: C1[X(C20H22O5)]
method: RPBEPBE
basis: SDD
operation: Freq
keyword: #pfreq=noraman
keyword: PBEPBE/SDD
title: #p freq=noraman PBEPBE/SDD
converged: YES YES NO NO
title: Mulliken charges:
elementType: O O O O O C C C C C C C C C C C C C C C C C C C C H H H H H H H H H H H H H H H H H H H H H H
charge: -0.277896 -0.285014 -0.271984 -0.269603 -0.265933 -0.160791 -0.353961 0.333779 0.351911 -0.773221 0.155336 0.525896 -0.791236 -0.503032 -0.528244 0.168436 -0.452265 -0.383290 0.198377 -0.524855 -0.362686 -0.372019 -0.203112 0.307603 -0.538121 0.249044 0.273996 0.220920 0.235223 0.242449 0.236925 0.238505 0.231535 0.273897 0.270894 0.240940 0.241565 0.213764 0.230932 0.237347 0.248354 0.238095 0.232754 0.233263 0.219563 0.221176 0.244784
chargesum: 0.00000
title: Mulliken charges with hydrogens summed into heavy atoms:
elementType: O O O O O C C C C C C C C C C C C C C C C C C C C
charge: -0.277896 -0.285014 -0.271984 -0.269603 -0.265933 0.088253 -0.079965 0.333779 0.351911 -0.074629 0.155336 0.525896 -0.084270 -0.229135 -0.257350 0.168436 -0.211325 -0.141725 0.198377 0.157188 -0.114332 -0.133924 0.262905 0.307603 0.147402
polarizability: 2.81545029e+02 -2.98115310e+00 2.53086409e+02 -9.30496774e+00 -3.96747627e+00 1.72424330e+02
1716.lowfreq: -67.7893 -4.8927 -0.0007 -0.0002 0.0002 1.5937 6.5425 32.2446 33.0825
frequency: -67.7463 32.1530 33.0558 40.4549 51.7222 78.9922 97.3789 106.2577 132.6530 149.4325 154.4825 168.3200 179.9918 188.5244 209.9269 229.8956 233.6457 240.6950 255.5121 274.3430 292.9545 306.1575 312.2301 329.3455 349.1837 358.6718 402.4683 413.9638 430.0167 444.9263 460.8951 502.9795 515.4592 526.5875 538.6654 578.2654 593.4828 631.9763 646.5883 677.8359 682.6215 691.3240 701.5329 734.3750 739.8035 756.8832 773.8608 801.1208 816.3395 827.3550 834.0278 846.7590 851.1309 869.2836 877.3494 888.9056 934.2627 950.4630 964.4200 978.4747 988.2324 990.8892 1003.2672 1014.1683 1035.6615 1066.4150 1067.5092 1093.6209 1109.2085 1111.6650 1112.4241 1114.8664 1118.4693 1137.1631 1147.2067 1155.0878 1156.0948 1162.3543 1178.5088 1207.4180 1220.5423 1229.2288 1234.0733 1261.4923 1273.1743 1274.5699 1310.4464 1318.1532 1334.2445 1362.5101 1382.0807 1384.1684 1391.0546 1400.2256 1416.8393 1420.2983 1425.8042 1436.8567 1456.1977 1461.9614 1466.7705 1470.3605 1472.8990 1473.1824 1480.4129 1483.6930 1487.9128 1489.6715 1501.3409 1583.0538 1621.9730 1624.7767 1628.8215 2957.4321 2966.3083 2973.7551 2991.8292 2995.8661 3004.7914 3005.2171 3044.5458 3060.1289 3079.7392 3085.7273 3094.1423 3101.7363 3112.2406 3114.0576 3121.4185 3123.0512 3124.2874 3159.6363 3165.1374 3169.1414 3190.1569
redmass: 2.3747 4.4522 5.3595 3.4896 4.1367 4.2149 3.4173 2.7076 2.2196 3.3503 4.1364 1.6415 3.9417 2.6031 1.3072 3.6596 1.4911 1.3820 3.1941 4.1181 4.2088 2.2065 3.0576 4.0794 6.8543 4.4894 5.0367 2.9402 3.4160 4.7752 4.3175 3.8180 4.5221 3.7144 3.8311 4.6035 3.8082 6.8747 8.2219 8.4466 5.2719 6.2326 4.2882 3.9262 4.5740 5.0044 5.7661 3.2624 1.3894 3.5814 1.6084 10.1267 1.4918 2.5476 2.3302 1.4848 1.7100 1.5724 1.3605 5.5183 7.3390 3.5167 2.6604 5.8235 1.8374 1.4584 2.4718 1.8841 1.8493 1.4793 1.2599 1.7256 1.0363 1.8536 1.9015 1.7735 1.5319 3.2572 1.2525 1.7397 1.3342 3.2601 2.0758 2.2020 1.8380 4.0303 1.3800 1.5138 1.4696 1.3236 3.2308 1.3936 1.2659 4.6347 3.2531 6.2230 1.1387 1.1772 1.0560 1.0614 1.0508 2.6356 1.0887 1.0584 1.0552 1.0484 1.0503 1.2454 2.4539 7.0530 6.3874 9.5382 8.8374 1.0330 1.0324 1.0807 1.0356 1.0838 1.0523 1.0373 1.1039 1.1018 1.1188 1.0991 1.0999 1.0994 1.1012 1.1001 1.0900 1.0957 1.0917 1.0935 1.0951 1.0924 1.0932
irintensity: 13.0077 0.1115 0.1444 1.3129 1.2486 0.4333 0.5834 8.5250 0.7143 1.6600 2.7086 1.2129 4.4398 2.6553 1.1734 0.2105 0.8919 0.9820 1.7947 1.6087 0.6242 0.2139 3.5075 0.7578 3.1629 0.6347 15.0950 0.3367 6.9369 4.0964 1.7834 1.3720 2.8538 19.3134 22.1667 4.7867 4.3494 1.8158 0.4819 1.3263 1.8374 6.3549 0.3094 1.0455 24.3293 12.6367 5.4066 72.5690 11.6020 11.5268 29.1061 33.2251 28.8707 78.8475 36.7833 33.9730 9.2840 3.6463 0.0157 192.5891 21.6380 81.3174 12.9301 37.4983 81.0659 4.2207 66.7677 85.0469 7.6331 32.7405 0.4875 9.8308 0.0106 136.4836 49.7545 32.1705 10.5979 22.6498 63.8803 13.0064 7.1280 184.2610 27.7986 16.2036 23.2125 113.2089 1.2202 7.8194 4.1772 2.4469 15.8392 43.0741 9.2604 92.9764 0.0569 1.7735 5.6563 10.1881 3.2842 6.6602 12.3093 252.8395 62.2660 19.1603 6.5056 10.0446 3.1985 22.1066 122.7514 6.4524 50.0886 14.1463 7.6907 69.2665 76.7665 1.2955 29.7779 17.3808 154.4354 8.0180 48.1999 42.8540 36.1218 31.7930 17.8485 27.8040 10.7959 21.8755 18.7684 34.3515 2.9570 13.9748 6.3012 1.9344 0.4718
temp: 298.150 k
press: 1.00000 atm
elementType: 8 8 8 8 8 6 6 6 6 6 6 6 6 6 6 6 6 6 6 6 6 6 6 6 6 1 1 1 1 1 1 1 1 1 1 1 1 1 1 1 1 1 1 1 1 1 1
symmnumber: 1
zpe: 987396.2 jmol-1
zpe.correction: 0.376079 hartree
zpe.thermalcorrener: 0.398912 hartree
zpe.thermalcorrenthalpy: 0.399856 hartree
zpe.thermalcorrgfe: 0.324066 hartree
zpe.sumelectzpe: -1149.558438 hartree
zpe.sumelectthermal: -1149.535605 hartree
zpe.sumelectthermalent: -1149.534661 hartree
zpe.sumelectthermalfe: -1149.610451 hartree
dipole: -0.2564 -0.6892 -1.4577
dipole: 1.6327
quadrupole: -136.5081 -133.2217 -142.8061
quadrupole: -7.7898 12.9594 -2.4834
quadrupole: 1.0039 4.2903 -5.2942 -7.7898 12.9594 -2.4834
hfenergy: -1149.9345169 hartree
pointgroup: C01 [X(C20H22O5)]
dipole: -0.1169288 -0.2933872 -0.5593265 debye
polarizability: 281.0843402|-4.7905625|252.9000791|-9.9449031|-7.3707296|173.0713489 unknown
InChI: InChI=1S/C20H22O5/c1-12-19(13-5-7-14(21-3)8-6-13)15-9-17-18(24-11-23-17)10-16(15)25-20(12,2)22-4/h5-10,12,19H,11H2,1-4H3
charge 0 multiplicity 1
47 atoms
O  2.412747 -1.501853 -0.949798
O  1.974914 -2.746631 1.067441
O  1.631587 3.842723 0.486103
O  3.633917 3.239391 -0.706607
O  -5.62896 0.789039 0.129915
C  0.109363 -2.23122 -0.345139
C  -0.122972 -0.941626 0.510802
C  1.614023 -2.60304 -0.338446
C  0.902989 0.141313 0.153535
C  -0.770988 -3.403118 0.135532
C  2.101823 -0.186387 -0.531954
C  -1.567421 -0.452716 0.385893
C  1.980403 -3.821966 -1.190584
C  0.683153 1.497758 0.538305
C  3.083201 0.785354 -0.873678
C  1.647554 2.446041 0.208212
C  -2.465832 -0.542671 1.480755
C  -2.059621 0.079792 -0.830568
C  2.822088 2.09757 -0.489109
C  3.379749 -3.084773 1.339262
C  -3.805801 -0.124041 1.369509
C  -3.399542 0.504442 -0.966103
C  2.89209 4.37474 -0.090169
C  -4.278709 0.399821 0.141595
C  -6.159626 1.343897 -1.116915
H  -0.140673 -1.996479 -1.399896
H  0.053067 -1.234652 1.566081
H  -0.698425 -4.270434 -0.544031
H  -0.462382 -3.726303 1.145518
H  -1.82994 -3.095895 0.174909
H  1.510419 -3.74277 -2.185349
H  3.072257 -3.872705 -1.337283
H  1.63735 -4.7507 -0.706352
H  -0.233288 1.779888 1.063173
H  3.989259 0.492173 -1.407328
H  -2.109076 -0.946988 2.436006
H  -1.380807 0.183144 -1.685933
H  3.609034 -4.129513 1.052857
H  3.498812 -2.970045 2.427841
H  4.062883 -2.39386 0.812228
H  -4.498756 -0.191149 2.213768
H  -3.740501 0.913548 -1.922094
H  2.648093 5.109675 -0.877497
H  3.507447 4.804284 0.719821
H  -6.101969 0.608465 -1.943277
H  -5.624352 2.269165 -1.407082
H  -7.212878 1.577408 -0.902167
