program: Gaussian 09
title: 000146801
version: EM64L-G09RevD.01
frameworkgroup: C1[X(C24H26FNO4)]
method: RPBEPBE
basis: SDD
operation: Freq
keyword: #p
keyword: freq=noraman
keyword: PBEPBE/SDD
title: #p freq=noraman PBEPBE/SDD
converged: YES YES NO NO
title: Mulliken charges:
elementType: F O O O O N C C C C C C C C C C C C C C C C C C C C C C C C H H H H H H H H H H H H H H H H H H H H H H H H H H
charge: -0.237720 -0.440303 -0.474878 -0.403445 -0.286727 -0.266017 -0.061122 0.159629 0.247215 0.066631 0.139579 -0.373669 -0.689122 -0.683648 0.337525 -0.343112 -0.392782 -0.166065 -0.450940 -0.186219 -0.023290 -0.261432 -0.261203 -0.386585 -0.396352 -0.519450 -0.387003 -0.393070 0.312726 0.225442 0.225659 0.241696 0.215991 0.234914 0.231127 0.231427 0.216817 0.227700 0.222522 0.248639 0.243320 0.238360 0.217463 0.272176 0.230221 0.220993 0.223270 0.255901 0.260513 0.253231 0.242278 0.286767 0.254894 0.334317 0.363983 0.401227
chargesum: 0.00000
title: Mulliken charges with hydrogens summed into heavy atoms:
elementType: F O O O O N C C C C C C C C C C C C C C C C C C C C C C C C
charge: -0.237720 -0.105986 -0.110895 -0.002218 -0.286727 -0.266017 0.164537 0.159629 0.247215 0.066631 0.139579 -0.131974 -0.007090 -0.007705 0.337525 -0.120590 -0.144143 0.077255 0.004884 0.085957 0.206932 -0.040438 -0.037933 -0.130684 -0.135839 -0.023941 -0.100236 -0.138177 0.312726 0.225442
polarizability: 3.75409092e+02 -5.13798487e-01 3.11875174e+02 3.67899512e-01 1.65355756e+01 1.89543360e+02
1716.lowfreq: -12.2024 -3.2380 -0.0009 -0.0002 0.0005 4.8775 15.5619 31.7762 39.9072
frequency: 13.8727 31.7275 39.6387 46.0675 49.1911 54.4016 66.2586 69.7534 81.8052 84.9865 92.9391 104.6046 124.4605 138.6066 153.4360 165.9197 172.1402 178.5861 199.8958 202.5829 217.7298 230.3592 249.4155 254.7218 274.3796 281.7122 323.5186 325.8607 341.9370 360.2736 365.8111 380.2443 398.4291 415.5645 423.5065 433.1374 443.1539 451.6651 476.4141 491.4385 506.4479 522.2286 530.7406 546.5098 550.7855 566.7488 585.5478 593.9383 623.1613 630.2481 659.0430 679.4773 707.9566 715.9278 717.0459 735.6937 750.6942 763.8399 789.3804 820.8533 827.9235 836.6966 849.3202 850.7216 860.3197 880.1338 896.8383 916.2899 918.4301 930.7407 932.0805 941.0764 943.6599 950.5998 961.1418 964.8916 972.3880 975.1409 1006.2435 1020.8590 1023.1534 1047.4743 1059.8297 1074.5410 1085.6329 1101.9728 1106.4318 1120.0300 1142.1135 1146.1727 1146.9732 1166.1632 1170.2764 1177.6327 1187.8068 1195.6660 1213.5118 1224.6343 1242.4273 1247.6049 1260.4585 1279.5476 1293.5164 1297.3035 1302.6837 1305.8000 1320.4747 1325.5362 1328.2703 1340.3527 1349.1974 1356.2861 1366.4352 1374.8435 1379.7527 1395.4155 1398.9772 1407.8525 1413.4155 1419.9759 1432.2645 1452.4831 1459.4433 1461.7918 1468.5561 1469.5945 1476.1196 1487.6558 1489.0478 1549.6904 1575.8585 1593.3129 1606.8817 1617.3900 1618.6686 1654.3789 2953.4327 2990.4767 2994.0673 2996.4438 3004.4465 3014.4440 3023.4341 3054.2855 3072.2173 3086.0398 3091.1489 3095.2737 3099.7215 3101.5722 3107.8854 3127.3116 3139.7274 3147.0869 3153.0030 3156.1574 3168.7938 3174.1340 3178.2629 3436.4548 3455.6579 3554.0251
redmass: 4.9416 4.5261 4.4636 4.9545 5.6821 6.1435 3.9602 4.6342 4.3830 4.4167 5.9605 6.3905 4.1892 4.1170 3.5203 2.0833 2.7358 1.9847 2.9759 1.6408 4.1300 3.4545 3.6639 3.1913 4.2125 4.0650 1.3424 3.0557 3.3528 4.1282 5.3284 4.6117 4.4946 3.0075 2.8186 3.0884 4.1681 2.8731 2.5863 3.0352 3.0108 3.6157 3.7087 2.1041 3.4254 2.0621 3.8672 3.8334 6.2314 1.4514 3.8457 5.4618 4.6710 4.2151 3.5895 3.6460 1.5788 3.8448 5.7455 1.2555 3.0668 1.6499 1.4752 2.3815 3.2742 2.7062 2.1538 1.3183 3.0657 2.3504 1.9804 1.4600 3.1806 1.5823 1.3986 2.1729 1.2894 1.1766 3.0278 2.0333 2.6656 3.0669 3.1571 1.8354 2.1754 1.8227 1.4396 2.2680 2.4178 1.5860 2.0588 1.3978 1.2646 1.7226 1.4447 1.2265 1.2327 3.1557 2.0114 1.4478 1.3604 1.2974 1.3002 1.1302 1.5124 1.3663 1.3722 1.7329 1.5011 1.8743 3.0927 2.1012 2.1637 1.8912 1.2060 1.2908 2.6431 2.9339 3.3404 1.6275 1.1333 1.0973 3.6283 1.0550 1.9785 1.0658 1.2552 1.4929 1.6846 7.7982 6.6323 7.8584 6.5348 7.6336 7.2872 7.1567 1.0837 1.0355 1.0360 1.0797 1.0656 1.0845 1.0611 1.0885 1.1023 1.1000 1.0997 1.1003 1.0906 1.0991 1.1014 1.0849 1.0897 1.0893 1.0892 1.0951 1.0986 1.0961 1.0969 1.0658 1.0641 1.0662
irintensity: 0.1241 0.4648 0.9450 0.2631 0.0544 3.1425 3.7937 3.3674 0.6994 0.4351 0.2827 3.9477 1.1535 1.3848 3.5186 0.8308 2.8838 1.1568 1.2734 2.6457 3.1508 1.9723 2.8190 3.2918 2.7260 4.0629 132.9735 13.8736 1.0087 8.3838 14.8210 4.1627 4.5270 0.2482 0.4262 5.3206 3.3201 5.1851 10.0007 7.9260 37.8395 15.0524 7.6145 9.6436 105.6381 61.3682 2.0863 6.3209 10.7495 389.7256 4.4098 3.0595 27.4108 6.2417 104.8161 11.2926 73.6901 1.0022 5.2199 0.9517 32.9660 70.0980 0.5722 3.0565 3.3537 0.6837 0.0940 1.9464 13.1357 4.0006 2.5416 3.6181 53.9092 12.9407 4.2754 9.4419 2.6290 61.6937 6.2637 13.1071 14.1561 11.8450 11.5572 102.7439 63.7205 25.9204 34.3837 114.9801 9.4766 45.1082 54.1699 18.3684 9.5583 5.9726 20.9788 17.4567 21.6342 17.3149 13.6868 34.1244 22.5317 1.5746 7.8067 41.4138 23.5604 12.9602 6.0908 43.7690 85.4290 16.3195 12.5453 55.8948 10.2635 9.7577 25.1664 32.3325 3.8502 15.8712 31.4080 40.2187 14.9192 13.3927 29.3325 1.9448 14.5061 1.8237 6.9375 33.9972 49.7749 90.3510 0.5465 3.4127 5.5627 156.9731 10.5718 7.2696 37.2250 21.0609 26.5920 9.4137 25.6169 6.1680 10.5829 19.1529 23.3968 8.8136 57.7447 5.6732 10.1390 43.6836 10.6013 0.7108 13.3219 4.9405 5.9926 31.5679 31.4764 3.2491 0.2937 55.8494 67.1775 6.6385
temp: 298.150 k
press: 1.00000 atm
elementType: 9 8 8 8 8 7 6 6 6 6 6 6 6 6 6 6 6 6 6 6 6 6 6 6 6 6 6 6 6 6 1 1 1 1 1 1 1 1 1 1 1 1 1 1 1 1 1 1 1 1 1 1 1 1 1 1
symmnumber: 1
zpe: 1173696.3 jmol-1
zpe.correction: 0.447037 hartree
zpe.thermalcorrener: 0.476341 hartree
zpe.thermalcorrenthalpy: 0.477285 hartree
zpe.thermalcorrgfe: 0.385829 hartree
zpe.sumelectzpe: -1383.456582 hartree
zpe.sumelectthermal: -1383.427279 hartree
zpe.sumelectthermalent: -1383.426335 hartree
zpe.sumelectthermalfe: -1383.517790 hartree
dipole: 3.6269 1.3361 -0.7841
dipole: 3.9439
quadrupole: -168.0858 -175.9118 -181.2203
quadrupole: 11.6941 6.6806 7.6975
quadrupole: 6.9868 -0.8391 -6.1477 11.6941 6.6806 7.6975
hfenergy: -1383.9036196 hartree
pointgroup: C01 [X(C24H26F1N1O4)]
dipole: 1.4073488 0.5929725 -0.2745823 debye
polarizability: 375.3386177|1.7310937|307.4299449|-3.0070985|28.259489|194.0590636 unknown
InChI: InChI=1S/C24H26FNO4/c1-15(2)26-21-6-4-3-5-20(21)24(16-7-9-17(25)10-8-16)22(26)12-11-18(27)13-19(28)14-23(29)30/h3-12,15,18-19,27-29H,13-14H2,1-2H3
charge 0 multiplicity 1
56 atoms
F  -3.683694 -3.413148 -0.246145
O  -1.004831 4.503819 -0.922073
O  -3.324672 1.949198 1.579556
O  -5.267234 -1.052345 -0.793438
O  -4.984819 -0.391119 1.413421
N  2.949491 0.926696 0.286119
C  3.555545 2.260111 0.544911
C  1.555028 0.682584 0.241286
C  3.625667 -0.253438 -0.068387
C  1.327601 -0.660458 -0.119987
C  2.633149 -1.266111 -0.323927
C  0.579738 1.760699 0.513675
C  4.282328 2.809429 -0.705655
C  4.446855 2.247876 1.809104
C  0.027356 -1.364968 -0.162451
C  5.009619 -0.531593 -0.182195
C  3.049069 -2.582028 -0.65939
C  -1.340931 3.298313 -0.114415
C  -2.771827 2.94201 -0.55397
C  -0.335576 2.201342 -0.395571
C  -3.291891 1.677532 0.135816
C  5.393666 -1.839255 -0.537963
C  4.4241 -2.858837 -0.767431
C  -0.910515 -1.230991 0.900803
C  -0.301414 -2.236354 -1.239953
C  -4.705111 1.262615 -0.380753
C  -2.142431 -1.918535 0.888985
C  -1.531566 -2.930587 -1.277595
C  -2.422933 -2.744002 -0.210655
C  -5.026261 -0.103572 0.185115
H  2.698146 2.929096 0.744429
H  0.585734 2.219631 1.516169
H  4.644741 3.834536 -0.508588
H  3.595757 2.841959 -1.569767
H  5.150771 2.18914 -0.984874
H  3.88187 1.876845 2.682145
H  4.796402 3.272607 2.029573
H  5.334784 1.606155 1.682184
H  5.773347 0.228711 0.002553
H  2.309467 -3.373165 -0.821868
H  -1.335938 3.543319 0.966555
H  -3.433488 3.79666 -0.322783
H  -2.770585 2.795431 -1.651201
H  -0.341066 1.780572 -1.411874
H  -2.59051 0.838979 -0.066641
H  6.459042 -2.077738 -0.631467
H  4.758243 -3.869156 -1.027726
H  -0.666826 -0.587773 1.751981
H  0.399088 -2.346533 -2.07432
H  -5.440406 2.003404 -0.016299
H  -4.733848 1.228681 -1.481006
H  -2.866699 -1.814279 1.701831
H  -1.795409 -3.58625 -2.112289
H  -0.073653 4.769947 -0.709816
H  -3.811724 1.195025 2.016024
H  -5.269247 -1.975382 -0.409765
