program: Gaussian 09
title: 000146586
version: EM64L-G09RevD.01
frameworkgroup: C1[X(C5H10S)]
method: RPBEPBE
basis: SDD
operation: Freq
keyword: #pfreq=noraman
keyword: PBEPBE/SDD
title: #p freq=noraman PBEPBE/SDD
converged: YES YES NO NO
title: Mulliken charges:
elementType: S C C C C C H H H H H H H H H H
charge: -0.042958 0.420204 -0.237081 -0.777867 -0.787418 -0.770673 0.231833 0.222137 0.230770 0.217420 0.220897 0.233226 0.225886 0.265902 0.260818 0.086904
chargesum: 0.00000
title: Mulliken charges with hydrogens summed into heavy atoms:
elementType: S C C C C C
charge: 0.043946 0.420204 -0.005248 -0.107541 -0.107410 -0.243952
polarizability: 1.04577246e+02 -3.41765815e+00 5.78437819e+01 3.87523622e+00 -1.08456108e-01 5.76407156e+01
1716.lowfreq: -7.8786 -0.0035 -0.0027 -0.0018 7.5804 11.8744 41.0119 102.8334 119.4032
frequency: 40.7992 102.7062 119.3821 181.3895 200.9224 294.7239 317.2281 380.8545 454.0065 506.7814 628.9536 745.5435 821.8409 881.0131 924.7726 948.6232 992.7100 1019.5785 1082.9162 1122.4624 1144.1945 1233.9880 1244.6840 1361.1200 1389.5628 1399.6379 1452.0178 1453.6374 1468.6078 1471.2890 1478.9094 1688.3990 2420.4606 2962.1270 2968.9839 3034.5433 3036.7604 3038.8467 3084.2282 3097.2774 3098.9322 3119.5313
redmass: 3.5410 1.2889 1.9658 1.1505 1.0625 2.3751 3.4595 2.3017 2.4301 2.5866 3.9583 2.0244 1.2842 1.5077 1.4840 1.3851 1.2476 1.7060 1.6852 1.3161 2.0499 1.6365 1.4979 1.3480 1.3212 1.2455 1.0938 1.0501 1.0574 1.0630 1.0820 6.1417 1.0384 1.0374 1.0386 1.0968 1.0579 1.0961 1.0986 1.0980 1.0936 1.1018
irintensity: 0.5875 1.7243 1.6774 1.0175 29.3236 0.1022 1.9383 0.1180 8.6033 5.2983 14.1563 1.4934 9.7015 17.7642 2.1666 0.4880 6.4340 10.4171 5.0769 5.0046 0.4617 20.5922 18.2100 0.1698 27.0277 13.1280 1.6785 1.2338 23.6916 18.3275 15.9278 18.9116 58.2457 31.1410 43.6450 6.6112 24.1179 46.3077 25.4308 30.9567 1.9633 36.3161
temp: 298.150 k
press: 1.00000 atm
elementType: 16 6 6 6 6 6 1 1 1 1 1 1 1 1 1 1
symmnumber: 1
zpe: 349399.0 jmol-1
zpe.correction: 0.133079 hartree
zpe.thermalcorrener: 0.141668 hartree
zpe.thermalcorrenthalpy: 0.142612 hartree
zpe.thermalcorrgfe: 0.099355 hartree
zpe.sumelectzpe: -594.071050 hartree
zpe.sumelectthermal: -594.062461 hartree
zpe.sumelectthermalent: -594.061517 hartree
zpe.sumelectthermalfe: -594.104774 hartree
dipole: -1.1410 0.5796 1.4684
dipole: 1.9478
quadrupole: -41.9555 -45.3716 -46.8419
quadrupole: 0.8435 4.7965 0.0644
quadrupole: 2.7675 -0.6486 -2.1189 0.8435 4.7965 0.0644
hfenergy: -594.2041287 hartree
pointgroup: C01 [X(C5H10S1)]
dipole: 0.3954747 -0.1168427 0.6459215 debye
dipolederiv: -0.2358687 0.0276115 -0.2191672 -0.0057745 -0.2725246 -0.0300832 -0.2390688 -0.0150269 0.0011737 0.3723213 -0.0195373 -0.1126283 -0.1620935 0.3072689 -0.0633206 -0.1300763 -0.0460365 -0.0560554 -0.216215 0.010354 -0.0321594 0.1235882 0.0057319 -0.0210287 -0.0491107 -0.098222 -0.3167155 -0.1014832 -0.0825771 0.058268 0.0043852 -0.0275851 0.0317152 0.0858432 0.0411931 0.076946 -0.0303559 0.0217651 0.0336659 -0.0059682 -0.1693684 0.0342822 0.0392939 0.025176 0.0819125 0.5009836 -0.0477472 0.2774413 0.114265 0.0887385 0.0293178 0.2273363 0.0278253 0.250896 0.0360256 -0.0104125 0.0333032 -0.0380104 -0.1281114 0.0397616 0.0504717 0.0633651 0.1481123 0.0123539 0.0070742 0.0575646 0.0015691 0.0600913 -0.1019682 0.1354745 -0.0662301 -0.0937903 0.0783494 0.0637257 0.0038202 -0.026693 -0.1596541 0.0316326 0.0105518 0.0124407 0.1015316 -0.1140466 0.0169573 -0.0883161 0.0186824 0.0885633 0.0615059 -0.1483247 0.0303888 -0.0040336 -0.0377594 0.0590573 -0.1283962 0.0585008 0.0430187 0.0111198 -0.1470921 0.0678813 -0.0112286 -0.0665041 -0.1359814 0.0601001 -0.0894364 0.0246871 0.0224114 0.0483255 0.0490815 0.0808676 0.0668802 0.0467149 0.0745573 0.0702536 0.0294171 -0.0433335 0.0981631 -0.107072 -0.0751851 -0.0764966 0.0424023 0.0094803 0.0289857 0.0274062 -0.1054631 -0.0059115 -0.0812584 -0.0775742 0.0148634 0.0210646 -0.0891821 -0.033356 -0.0793053 0.095628 -0.0818457 0.0814869 -0.0267678 -0.203048 -0.0204715 0.0616484 -0.0588981 0.1616261 0.0078227 0.1059696 0.0150071 -0.0800893 unknown
polarizability: 104.4255717|-5.7582356|58.2232325|0.6326654|-0.2909479|57.4129395 unknown
InChI: InChI=1S/C5H10S/c1-5(2)3-4-6/h3,6H,4H2,1-2H3
charge 0 multiplicity 1
16 atoms
S  -2.688032 0.023861 -0.815664
C  0.966696 -0.031765 0.041152
C  -0.18462 0.668756 0.267543
C  2.231168 0.68312 -0.40413
C  1.104384 -1.535104 0.196392
C  -1.506085 0.113293 0.711002
H  -0.173955 1.753481 0.090001
H  2.566889 0.310382 -1.392257
H  2.082713 1.773821 -0.481265
H  3.063136 0.496298 0.303386
H  1.855591 -1.780102 0.973327
H  0.159357 -2.03509 0.461749
H  1.467356 -1.985659 -0.748123
H  -1.992173 0.785381 1.436877
H  -1.431961 -0.897676 1.137978
H  -3.870563 -0.076698 -0.094067
