program: Gaussian 09
title: 000146582
version: EM64L-G09RevD.01
frameworkgroup: C1[X(C4H5N3O)]
method: RPBEPBE
basis: SDD
operation: Freq
keyword: #pfreq=noraman
keyword: PBEPBE/SDD
title: #p freq=noraman PBEPBE/SDD
converged: YES YES NO YES
title: Mulliken charges:
elementType: O N N N C C C C H H H H H
charge: -0.205239 -0.116455 -0.014874 0.008165 0.053719 -0.162292 -0.593977 -0.264002 0.271662 0.268273 0.268158 0.223456 0.263406
chargesum: 0.00000
title: Mulliken charges with hydrogens summed into heavy atoms:
elementType: O N N N C C C C
charge: -0.205239 -0.116455 -0.014874 0.008165 0.053719 0.109370 0.165909 -0.000596
polarizability: 1.05067335e+02 -4.56026258e+00 6.99740255e+01 -1.86984787e-05 4.18777685e-03 3.26333515e+01
1716.lowfreq: -60.9465 -11.3158 -8.4160 -2.9137 -0.0008 -0.0006 -0.0006 161.9298 199.1569
frequency: -60.8791 161.9284 199.1557 209.0517 281.7125 331.8785 540.2340 617.9040 629.2103 673.6245 777.5135 781.3602 861.9762 886.1026 1033.6473 1063.4962 1117.9326 1121.9475 1197.2115 1273.7742 1294.7593 1320.3801 1362.9677 1412.7188 1418.3676 1459.2081 1477.4758 1491.1154 3021.0411 3122.1860 3129.5096 3222.0080 3247.6882
redmass: 1.0538 7.4708 5.7398 3.9046 5.7646 4.1033 6.0536 2.9294 5.3932 10.5370 1.2463 9.1068 1.4312 6.4879 1.9475 1.2967 3.2711 1.3311 2.7917 3.9141 6.3974 3.8953 7.5854 3.1766 1.6883 1.0402 1.6492 1.3173 1.0330 1.1024 1.1033 1.0927 1.1070
irintensity: 0.3536 2.0020 2.9586 0.9855 0.5570 1.3386 1.8357 1.0802 12.4436 3.7357 63.1222 46.9235 5.5621 7.1264 19.4098 7.4194 5.4903 1.1366 34.6476 192.1869 133.5945 9.4274 16.2235 2.9323 3.7353 17.3116 40.3325 11.0978 22.3401 7.9314 8.2577 3.0840 1.2458
temp: 298.150 k
press: 1.00000 atm
elementType: 8 7 7 7 6 6 6 6 1 1 1 1 1
symmnumber: 1
zpe: 243673.9 jmol-1
zpe.correction: 0.092810 hartree
zpe.thermalcorrener: 0.099300 hartree
zpe.thermalcorrenthalpy: 0.100244 hartree
zpe.thermalcorrgfe: 0.061993 hartree
zpe.sumelectzpe: -394.220456 hartree
zpe.sumelectthermal: -394.213967 hartree
zpe.sumelectthermalent: -394.213022 hartree
zpe.sumelectthermalfe: -394.251274 hartree
dipole: 6.3903 3.0039 0.0001
dipole: 7.0612
quadrupole: -49.3411 -43.8187 -46.1716
quadrupole: -0.7720 0.0007 0.0020
quadrupole: -2.8973 2.6251 0.2722 -0.7720 0.0007 0.0020
hfenergy: -394.3132668 hartree
pointgroup: C01 [X(C4H5N3O1)]
dipole: -2.5918442 1.0000158 -0.0014857 debye
dipolederiv: -1.0826168 -0.2687953 -0.000393 0.4535452 -0.1707135 0.0001554 -0.0002674 -0.0001578 -0.1360931 0.4148738 0.0703781 0.0003079 0.1504412 -0.6501965 0.0003131 0.0002895 -0.0002987 -0.082283 0.0644256 0.0597343 0.0000825 0.3605421 -0.359617 0.0002672 0.000222 0.0000832 -0.1957855 1.4699178 0.4825918 0.0006222 0.1491706 0.1382139 0.0001741 0.0006994 0.000412 -0.1787747 -0.6576043 -0.4061583 -0.0002646 -0.8433454 0.1000425 -0.0004803 -0.0005273 -0.0003869 0.1644184 -0.1394403 0.1405128 -0.0000325 -0.618645 0.1268841 -0.000385 0.0000171 0.0001596 -0.1007143 0.1877213 -0.0548817 -0.000123 -0.0732174 0.4087077 -0.000378 -0.0002203 -0.0000558 0.1818454 -0.4042118 -0.0225682 -0.0002047 0.3835334 0.215946 0.000036 -0.0002222 -0.0000601 -0.1377174 0.0285978 0.0362046 -0.0000947 0.0766323 0.0923397 0.0000556 -0.0000049 0.0000541 0.2056775 0.0794401 -0.0350674 -0.0796063 0.0262121 0.0211632 -0.0199555 -0.0461706 -0.0694844 -0.0112375 0.0796126 -0.0346475 0.079354 0.0263721 0.0207246 0.0200937 0.0459525 0.0697611 -0.0120377 -0.1047627 0.0867694 0.0003769 -0.014405 0.0443143 0.0000968 0.0003005 -0.0000086 0.1277944 0.0640468 -0.0540725 -0.0000246 -0.0768362 0.0121911 0.0000069 -0.0000683 -0.0000177 0.1749076 unknown
polarizability: 104.2427719|7.0037397|70.7985704|0.0307326|-0.0111191|32.6333696 unknown
InChI: InChI=1S/C4H5N3O/c1-7-3-2-5-4(7)6-8/h2-3H,1H3
charge 0 multiplicity 1
13 atoms
O  2.67925 0.05431 0.000479
N  -0.840478 0.614012 -0.000959
N  0.166887 -1.447264 -0.000185
N  1.558094 0.691602 0.000336
C  0.382142 -0.094306 -0.000169
C  -1.845915 -0.327781 -0.001342
C  -0.991832 2.081151 -0.001593
C  -1.203392 -1.593166 -0.000529
H  -2.899724 -0.059549 -0.001927
H  -0.510586 2.511962 0.889933
H  -0.513612 2.510988 -0.895245
H  -2.064431 2.330724 0.00005
H  -1.672503 -2.574983 -0.000449
