program: Gaussian 09
title: 000010105
version: EM64L-G09RevD.01
frameworkgroup: C1[X(C10H20O3)]
method: RPBEPBE
basis: SDD
operation: Freq
keyword: #pfreq=noraman
keyword: PBEPBE/SDD
title: #p freq=noraman PBEPBE/SDD
converged: YES YES NO NO
title: Mulliken charges:
elementType: O O O C C C C C C C C C C H H H H H H H H H H H H H H H H H H H H
charge: -0.335891 -0.286974 -0.436670 0.379430 -0.083094 -0.083097 -0.056047 -0.345231 -0.747025 -0.731760 -0.748251 -0.733041 -0.350854 0.228505 0.224879 0.241742 0.198195 0.227728 0.220125 0.216743 0.238166 0.231658 0.213437 0.220463 0.222245 0.219335 0.227425 0.237805 0.211530 0.220717 0.189597 0.213053 0.355158
chargesum: 0.00000
title: Mulliken charges with hydrogens summed into heavy atoms:
elementType: O O O C C C C C C C C C C
charge: -0.335891 -0.286974 -0.081512 0.379430 0.145411 0.141782 0.185696 0.080692 -0.071992 -0.066202 -0.079247 -0.062988 0.051795
polarizability: 1.27817287e+02 -8.06677366e-01 1.14771545e+02 5.72417338e+00 -1.00496957e+00 1.04622118e+02
1716.lowfreq: -10.4681 -0.0009 -0.0006 0.0002 7.6219 11.2245 62.8847 73.6618 95.6121
frequency: 62.7829 73.4576 95.4653 105.9637 120.8378 176.0382 191.6306 221.3455 225.1227 241.0910 254.1469 267.0160 276.0572 289.7315 323.1205 365.9207 369.7040 400.5635 436.3241 445.5305 454.6478 474.7528 578.7756 591.3952 627.3722 717.2105 820.1106 854.1024 867.7977 890.3199 917.3687 926.2982 929.3102 953.3259 960.4677 963.5850 983.4065 1009.0948 1031.7585 1043.0105 1073.6708 1102.4804 1103.3849 1128.8629 1155.0469 1162.7948 1176.5800 1194.2903 1198.1139 1201.8410 1274.3031 1296.6110 1300.5915 1305.1393 1321.8902 1335.2811 1342.1597 1357.3021 1370.2389 1376.2442 1389.7519 1391.2161 1397.0801 1456.9576 1469.4278 1470.6509 1472.7754 1475.9253 1481.8009 1486.0355 1486.6880 1496.0565 1499.9905 2959.9763 2979.9231 2981.7851 2982.3147 2984.8588 2985.3353 2996.2332 3002.0552 3010.8269 3070.0468 3073.0847 3074.1679 3078.0157 3078.8138 3079.3750 3083.7231 3085.0012 3090.2785 3092.8824 3548.1320
redmass: 4.7532 2.9791 3.3027 2.6909 2.8455 2.4494 2.1313 1.3908 1.3788 1.2049 1.5431 1.7747 1.5252 2.9954 2.5144 3.4081 2.7166 3.1427 2.5128 1.6864 2.1783 2.2462 2.9522 2.9577 3.2817 7.1330 3.2726 3.8902 2.4274 2.4786 1.1892 1.3949 1.2422 2.5475 1.9607 1.3783 4.1563 2.3733 2.5851 3.3410 2.2986 2.1582 2.0696 2.2342 2.1963 1.5139 1.6908 1.4484 1.9016 1.7822 1.3065 1.4975 1.3800 1.3011 1.3486 1.2215 1.4511 1.3456 1.2252 1.2176 1.3124 1.2061 1.2027 1.0866 1.0590 1.0500 1.0502 1.0542 1.0601 1.0511 1.0457 1.0570 1.0558 1.0672 1.0608 1.0386 1.0354 1.0365 1.0365 1.0826 1.0827 1.0829 1.0967 1.0996 1.0996 1.0992 1.0990 1.0997 1.0998 1.0996 1.0994 1.0997 1.0656
irintensity: 1.1687 1.2710 1.9922 0.6012 5.7196 1.7828 1.2580 1.0886 0.8683 0.9801 0.0629 0.2180 2.4770 7.0042 1.2437 1.0656 6.5752 10.3031 32.3646 86.6808 30.1207 23.7042 2.1634 0.7987 5.7894 3.1836 28.5896 46.5257 8.9866 4.5964 5.2186 1.3574 7.2990 22.2013 43.3791 1.3467 80.8800 78.9013 63.7255 90.2192 1.4524 15.5140 8.3535 18.1393 0.4883 14.7327 1.3578 12.8027 21.9923 3.6598 2.5361 1.7819 2.4884 6.0528 7.6044 2.6104 13.2710 2.4183 16.9660 14.2572 19.1668 42.1339 10.2637 4.1733 4.8100 2.3182 13.3773 3.8830 2.3750 15.2730 7.6725 30.2900 13.0036 35.8418 39.2686 68.1434 30.0991 36.0711 7.2155 14.0903 19.8478 47.2877 10.0323 4.8932 17.6398 30.0818 129.0329 13.8989 14.6030 60.4583 32.0418 30.4442 7.7484
temp: 298.150 k
press: 1.00000 atm
elementType: 8 8 8 6 6 6 6 6 6 6 6 6 6 1 1 1 1 1 1 1 1 1 1 1 1 1 1 1 1 1 1 1 1
symmnumber: 1
zpe: 756781.4 jmol-1
zpe.correction: 0.288243 hartree
zpe.thermalcorrener: 0.303458 hartree
zpe.thermalcorrenthalpy: 0.304402 hartree
zpe.thermalcorrgfe: 0.247481 hartree
zpe.sumelectzpe: -617.627781 hartree
zpe.sumelectthermal: -617.612566 hartree
zpe.sumelectthermalent: -617.611622 hartree
zpe.sumelectthermalfe: -617.668543 hartree
dipole: -1.1999 -0.6810 0.7705
dipole: 1.5803
quadrupole: -88.3834 -79.9626 -81.4828
quadrupole: -3.8630 9.1341 0.9164
quadrupole: -5.1071 3.3137 1.7935 -3.8630 9.1341 0.9164
hfenergy: -617.9160239 hartree
pointgroup: C01 [X(C10H20O3)]
dipole: -0.4966538 0.2430046 -0.284311 debye
polarizability: 127.5029587|2.4374777|115.2154257|-5.5230201|-0.7818284|104.4925657 unknown
InChI: InChI=1S/C10H20O3/c1-7(2)10(8(3)4)12-6-9(5-11)13-10/h7-9,11H,5-6H2,1-4H3
charge 0 multiplicity 1
33 atoms
O  0.676524 -0.182427 0.561982
O  -0.39421 0.426856 -1.467888
O  3.451689 -0.157998 1.292687
C  -0.660243 -0.055805 -0.081937
C  -1.339935 -1.449811 -0.198938
C  -1.470343 1.007492 0.714626
C  1.732421 -0.021638 -0.475491
C  1.02896 0.801054 -1.574146
C  -0.456865 -2.46067 -0.964892
C  -1.721544 -2.019402 1.18902
C  -0.768855 2.384479 0.720249
C  -2.911926 1.151484 0.167678
C  2.91741 0.6654 0.206508
H  -2.262192 -1.2917 -0.79218
H  -1.514484 0.643086 1.760238
H  2.031899 -1.023265 -0.838754
H  1.15678 1.889272 -1.406332
H  1.361708 0.537005 -2.591459
H  0.448053 -2.71418 -0.382886
H  -1.019537 -3.396816 -1.134288
H  -0.155039 -2.061892 -1.948385
H  -0.826518 -2.088017 1.834186
H  -2.139201 -3.036445 1.076749
H  -2.476926 -1.404359 1.709178
H  -0.757664 2.820104 -0.295445
H  -1.315704 3.081834 1.380587
H  0.267618 2.308182 1.09142
H  -2.888998 1.400862 -0.908796
H  -3.435997 1.967779 0.697279
H  -3.509176 0.232132 0.297952
H  2.597441 1.662529 0.578017
H  3.754845 0.794375 -0.500827
H  2.69301 -0.381299 1.891889
