program: Gaussian 09
title: 000146578
version: EM64L-G09RevD.01
frameworkgroup: C1[X(C10H10O3)]
method: RPBEPBE
basis: SDD
operation: Freq
keyword: #pfreq=noraman
keyword: PBEPBE/SDD
title: #p freq=noraman PBEPBE/SDD
converged: YES YES NO NO
title: Mulliken charges:
elementType: O O O C C C C C C C C C C H H H H H H H H H H
charge: -0.273969 -0.267063 -0.224995 -0.258362 -0.225058 0.481439 0.277102 -0.402176 -0.360647 -0.225055 -0.229730 -0.234940 -0.503065 0.263172 0.267873 0.235699 0.259951 0.229631 0.229429 0.231611 0.237801 0.247824 0.243526
chargesum: 0.00000
title: Mulliken charges with hydrogens summed into heavy atoms:
elementType: O O O C C C C C C C C C C
charge: -0.273969 -0.267063 -0.224995 0.004810 0.042815 0.481439 0.277102 -0.166477 -0.100696 0.004576 -0.000300 -0.003329 0.226086
polarizability: 1.67672448e+02 -9.16780477e-01 1.06952750e+02 7.95323065e+00 2.08297517e+00 7.36810430e+01
1716.lowfreq: -7.3469 -3.4395 -0.0007 -0.0006 -0.0006 6.0378 30.1680 45.4888 69.9763
frequency: 30.1051 45.4621 69.9741 83.8269 95.0436 176.6000 180.2041 220.0437 282.3095 319.1275 369.1412 402.9827 412.7797 520.5368 582.6158 614.1355 661.0693 690.5229 702.7897 744.2977 774.4252 814.2706 824.5415 854.3917 871.4179 924.4220 961.3229 977.9258 989.0563 998.0729 1026.0978 1057.5664 1083.7387 1092.5006 1112.7171 1138.5766 1149.0247 1173.4905 1179.6907 1186.5173 1235.9887 1298.5979 1329.1977 1381.9454 1396.7452 1422.7706 1444.7066 1452.0429 1462.0631 1487.9451 1593.4043 1616.3874 1644.8728 3007.0905 3098.8790 3109.9718 3121.9781 3129.8286 3137.5381 3141.1292 3152.4527 3154.4189 3166.9210
redmass: 4.2630 4.8160 2.1912 1.6460 3.4294 4.8090 4.4105 5.4619 4.8834 5.4059 5.3728 2.8537 6.3717 3.2645 6.4035 6.4702 6.2249 6.4624 1.9007 3.0525 2.7707 6.5652 5.3683 1.2516 4.5512 1.5201 5.3360 1.3957 6.0775 1.3192 2.1760 1.3377 1.5275 1.2494 1.2687 3.6854 1.4927 1.0921 2.0899 1.1693 1.5139 1.6686 1.3259 4.7498 2.9190 1.2220 2.2128 1.0496 1.0515 2.4714 6.1281 6.0412 9.8583 1.0295 1.0899 1.1047 1.0868 1.0868 1.0906 1.0915 1.0963 1.1049 1.1016
irintensity: 1.1537 2.3837 0.0685 0.3110 0.6187 0.6613 4.8049 4.3673 19.6826 8.9956 1.6247 0.2282 1.8094 14.7470 17.8576 0.0367 8.1473 11.5486 44.6740 61.8562 31.6327 9.5445 9.8558 0.0304 2.8301 2.5443 32.5046 0.3567 0.5883 0.2885 4.4094 2.9537 9.7604 6.1956 0.2180 313.7898 48.3095 0.5202 3.2476 0.5367 3.1428 23.5741 26.4454 29.5977 40.8348 35.3960 17.5734 15.7642 11.5107 5.6321 1.5987 1.7820 163.4536 31.1723 4.1748 23.7209 5.8814 0.2525 7.5177 12.0857 29.7287 14.7264 22.2897
temp: 298.150 k
press: 1.00000 atm
elementType: 8 8 8 6 6 6 6 6 6 6 6 6 6 1 1 1 1 1 1 1 1 1 1
symmnumber: 1
zpe: 462836.4 jmol-1
zpe.correction: 0.176285 hartree
zpe.thermalcorrener: 0.188522 hartree
zpe.thermalcorrenthalpy: 0.189466 hartree
zpe.thermalcorrgfe: 0.135866 hartree
zpe.sumelectzpe: -611.738465 hartree
zpe.sumelectthermal: -611.726228 hartree
zpe.sumelectthermalent: -611.725284 hartree
zpe.sumelectthermalfe: -611.778884 hartree
dipole: -0.2761 0.1396 -3.1895
dipole: 3.2045
quadrupole: -57.7119 -71.7040 -82.2926
quadrupole: -2.2902 -5.2215 -0.5101
quadrupole: 12.8576 -1.1345 -11.7231 -2.2902 -5.2215 -0.5101
hfenergy: -611.9147504 hartree
pointgroup: C01 [X(C10H10O3)]
dipole: -0.1466809 -1.0051675 0.7467327 debye
dipolederiv: -0.4681601 -0.0598566 0.0460758 -0.0787449 -0.5790336 0.06135 0.1406137 0.0252601 -0.2537987 -1.1791469 0.2649954 -0.3690643 0.4096066 -0.4085335 0.1872936 -0.5470647 0.2063486 -0.8135268 -0.7328484 0.0613818 0.1882262 0.1357988 -0.3226414 -0.0224528 0.026146 0.0897325 -0.8601013 0.6223747 0.0454521 -0.0432986 0.1060739 0.2909438 0.0074613 0.0058533 -0.0868524 0.2603476 -0.426988 0.0776851 -0.0689134 0.0800237 0.2103382 -0.0403114 -0.1454758 0.0359922 0.1482968 0.1290498 0.0279142 0.0211493 0.0163085 -0.0639913 -0.0046448 -0.0246489 0.0113375 -0.070687 1.5635189 -0.3130313 0.1705385 -0.6166955 0.3260521 -0.1470103 0.3561534 -0.2649601 1.3202864 -0.1311079 -0.0343542 -0.0851445 -0.0051121 -0.0724357 0.0936988 -0.0032367 0.1092588 -0.0117067 -0.1250169 0.0617662 0.0167315 0.0832331 -0.0291685 0.0737025 -0.0078831 0.0467168 -0.0792523 -0.0122077 0.0957824 0.0352766 0.1063088 -0.0055107 0.1002882 0.0536884 0.0981716 -0.0558808 -0.0439577 -0.0305066 -0.0841789 -0.059598 -0.0407433 0.1213135 -0.099167 0.1197187 0.0119407 0.042488 0.0510667 -0.0643662 0.0483014 -0.1057318 0.034683 -0.0472417 0.038792 -0.091258 0.6387089 -0.1140288 0.1214114 -0.1189652 0.3194619 -0.0447365 0.031611 -0.0067944 0.2232274 0.0218161 -0.0295704 0.023678 -0.009018 0.0543936 -0.0714525 0.0297656 -0.0599296 -0.0199202 0.0467538 0.0388867 0.0429168 0.0423993 0.0786901 0.0199285 0.0554552 0.0409098 -0.039632 0.061015 0.0371896 0.0951776 0.0314028 0.0761657 -0.0907273 0.0756866 -0.099066 0.0072738 0.0819424 -0.0804384 -0.0415854 -0.0705844 0.0505053 -0.0779095 -0.0471422 -0.0588455 0.0885614 0.0145764 -0.091309 -0.0395443 -0.106464 0.0227273 -0.10151 -0.0460815 -0.1024735 0.0674658 0.0417523 0.0275023 0.0752334 0.0348939 0.0599951 -0.1126756 0.0969262 -0.1081128 0.0052252 -0.1074799 -0.0499427 0.0664773 -0.0510218 0.1188549 -0.0232868 0.0700195 -0.0229284 0.1061361 0.0311267 0.0351188 -0.0519204 0.0465398 0.1049784 0.0402825 -0.1014115 0.0554856 -0.0672332 -0.052923 -0.0156422 -0.0027973 -0.0681599 -0.0334693 0.0650799 0.0930871 0.0594577 0.0794017 -0.0152866 -0.0060611 -0.0520791 0.0434733 -0.0518474 -0.0683642 0.0343473 -0.1272192 0.0448343 unknown
polarizability: 168.0735977|4.2926165|84.5764157|-2.7965958|16.0341783|95.6562274 unknown
InChI: InChI=1S/C10H10O3/c1-12-10(11)9-8(13-9)7-5-3-2-4-6-7/h2-6,8-9H,1H3
charge 0 multiplicity 1
23 atoms
O  0.728823 1.569092 -0.464717
O  3.302572 -0.540105 0.921251
O  3.028771 -0.217909 -1.378018
C  0.0938 0.2479 -0.827177
C  1.211116 0.30138 0.192781
C  -1.327063 0.02404 -0.427114
C  2.582678 -0.158062 -0.210789
C  -2.096461 -0.948253 -1.114989
C  -1.919391 0.761366 0.62997
C  -3.43537 -1.19478 -0.739115
C  -3.258711 0.518015 1.000311
C  -4.019249 -0.464124 0.321215
C  4.676539 -1.041763 0.666386
H  0.390567 -0.099456 -1.826495
H  0.969977 0.217992 1.25794
H  -1.647676 -1.511786 -1.942358
H  -1.334159 1.542781 1.127952
H  -4.022443 -1.948952 -1.274708
H  -3.713526 1.096486 1.812064
H  -5.059545 -0.650899 0.609792
H  5.070507 -1.297688 1.659296
H  5.282007 -0.255332 0.18593
H  4.642237 -1.926745 0.008993
