program: Gaussian 09
title: 000146605
version: EM64L-G09RevD.01
frameworkgroup: C1[X(C20H22O7)]
method: RPBEPBE
basis: SDD
operation: Freq
keyword: #pfreq=noraman
keyword: PBEPBE/SDD
title: #p freq=noraman PBEPBE/SDD
converged: YES YES NO NO
title: Mulliken charges:
elementType: O O O O O O O C C C C C C C C C C C C C C C C C C C C H H H H H H H H H H H H H H H H H H H H H H
charge: -0.263952 -0.419482 -0.268247 -0.264556 -0.306102 -0.290025 -0.310746 -0.372926 -0.124465 0.364439 -0.126284 0.583259 0.194022 -0.727804 -0.534602 -0.522479 -0.629811 -0.560238 0.159932 0.213166 0.261023 0.250053 0.012919 -0.206224 -0.527889 -0.523754 -0.525111 0.236488 0.254084 0.243933 0.205560 0.253410 0.236773 0.265006 0.272583 0.262211 0.281152 0.362870 0.228918 0.240419 0.229088 0.222989 0.252218 0.228936 0.262411 0.213678 0.254760 0.226825 0.231573
chargesum: 0.00000
title: Mulliken charges with hydrogens summed into heavy atoms:
elementType: O O O O O O O C C C C C C C C C C C C C C C C C C C C
charge: -0.263952 -0.056612 -0.268247 -0.264556 -0.306102 -0.290025 -0.310746 -0.136439 0.129619 0.364439 0.117649 0.583259 0.194022 -0.032060 -0.269596 -0.249896 -0.367600 -0.279086 0.159932 0.213166 0.261023 0.250053 0.012919 0.263113 0.176406 0.181271 0.188047
polarizability: 3.00867153e+02 2.27344193e+01 2.40034149e+02 1.08893014e+01 5.32797772e+00 1.98126702e+02
1716.lowfreq: -6.6320 -1.0258 -0.0004 -0.0002 0.0002 3.2182 16.5185 29.7792 39.7584
frequency: 14.4356 29.5307 39.7284 53.8088 67.6715 77.8517 81.4105 91.3151 98.0283 109.0667 132.9932 147.0949 153.3359 158.4914 164.4440 166.2775 181.8733 184.7862 209.5935 218.2682 233.0849 249.5501 252.2619 264.2320 284.1071 290.3985 310.4881 323.7688 353.7213 360.7110 370.0563 376.9600 431.9148 442.0642 463.0526 484.1947 504.4079 527.9821 563.2332 581.2205 603.1309 625.5170 642.4982 656.4654 675.2324 679.8619 696.5416 714.3097 745.7097 756.6602 768.3328 783.5243 787.3016 836.8109 849.9016 851.5643 865.6060 867.8930 877.2989 887.4120 901.0806 911.1079 940.7552 955.7857 972.9997 1005.9200 1010.3060 1034.3519 1051.2436 1067.1625 1073.7651 1090.3882 1106.8101 1109.9204 1112.0061 1112.9633 1116.3075 1128.5327 1146.4569 1150.1246 1154.3878 1158.2463 1173.3798 1185.0061 1196.9831 1209.7233 1223.4968 1245.3558 1255.5710 1266.9155 1293.8448 1315.5418 1326.5586 1348.1858 1359.2402 1360.5362 1385.3277 1394.7760 1410.2448 1414.9483 1416.5334 1431.8400 1434.4254 1437.8923 1454.0785 1457.4975 1459.1854 1465.4806 1469.2227 1470.4308 1476.7044 1484.0955 1485.1560 1486.4617 1486.6741 1568.1970 1604.0502 1622.5880 1631.6151 2965.0465 2972.9280 2974.5715 2977.7356 2985.3156 2991.3129 2992.3998 3028.1408 3070.7776 3077.7826 3081.7124 3084.4756 3105.7516 3109.3424 3120.8005 3121.3276 3126.0348 3141.3737 3158.6365 3160.3297 3193.0665 3566.6352
redmass: 4.8529 5.2691 5.6286 4.2797 2.8463 3.5643 3.0142 2.8309 2.5283 3.9473 2.2654 1.8168 1.8054 1.4340 1.6752 2.1988 1.6166 2.2850 3.5538 4.2190 5.0544 3.6375 3.6089 5.8363 5.0014 4.1812 1.6897 4.4084 4.2013 6.0189 5.1866 3.8548 4.5173 4.5083 5.2361 5.0811 5.8942 5.2972 6.5305 5.7788 5.7878 5.0308 4.9400 7.3445 6.8380 5.1928 4.6595 4.3268 6.8809 5.2786 3.8643 5.5983 4.0057 4.4412 3.1983 1.6864 2.7882 4.9752 1.6371 1.9025 2.0672 2.2727 8.7211 2.3791 5.2602 3.5341 3.6706 5.6167 2.1474 4.0560 1.4982 2.2236 2.5517 1.2404 1.2714 1.2464 1.7631 1.1064 2.1752 1.3683 1.3840 1.4545 3.2262 1.9915 1.3626 1.3670 1.2575 1.3475 1.8083 2.7806 5.0913 1.4278 1.5580 1.7076 3.2108 1.4467 1.2574 2.1745 2.8642 2.2743 1.2723 2.9019 1.2647 1.6962 1.2553 1.0638 1.0845 1.9009 1.3915 1.4607 1.0584 1.0548 1.0663 1.3650 1.0957 7.5259 6.9433 9.8909 8.2003 1.0846 1.0311 1.0334 1.0298 1.0831 1.0622 1.0371 1.0847 1.1037 1.1051 1.0990 1.0990 1.0994 1.1085 1.1033 1.1028 1.1045 1.0914 1.0916 1.0928 1.0934 1.0656
irintensity: 0.0140 0.5069 0.2686 1.7605 2.0702 0.1152 6.5040 13.8920 8.6690 1.5195 1.3706 0.5461 0.2036 1.7410 2.8517 2.5062 1.7199 4.3745 3.9121 0.6225 3.6939 4.6033 27.8308 0.9605 7.5562 13.8084 80.8548 3.1060 23.8314 0.8114 5.6191 49.5151 1.6169 1.1258 12.1086 9.1614 5.6558 4.3953 8.4170 9.8829 1.3699 0.6832 10.2317 8.0857 8.4745 19.9682 0.4611 7.9243 8.9015 6.6630 6.0705 1.5181 11.4730 20.0975 60.9619 20.9671 87.9067 11.4785 40.5724 10.1825 39.3072 42.3138 66.1982 33.4260 151.7328 59.2911 89.5824 159.8659 28.8796 257.7858 7.9419 17.0860 21.1499 11.5826 1.0971 5.0393 4.1005 15.9113 188.9012 3.5501 2.2572 13.9540 35.4952 23.5475 11.7898 21.0758 14.8302 7.9920 65.9761 21.2415 140.7234 62.6807 60.9871 22.3040 16.2890 2.9773 9.3437 58.0687 26.6293 36.0421 7.3240 6.7776 21.7654 38.0301 52.5134 22.1441 2.0462 73.7496 49.1374 116.1185 1.6514 19.3073 10.6768 53.7723 21.9148 73.1319 62.9941 13.4371 17.9600 52.6456 55.1496 108.0505 55.8131 14.9316 138.8679 26.7121 17.9802 26.0319 20.2689 33.1829 28.5485 16.9468 33.4926 24.1415 23.1428 16.3664 3.9875 0.4290 2.3865 0.1853 19.4305
temp: 298.150 k
press: 1.00000 atm
elementType: 8 8 8 8 8 8 8 6 6 6 6 6 6 6 6 6 6 6 6 6 6 6 6 6 6 6 6 1 1 1 1 1 1 1 1 1 1 1 1 1 1 1 1 1 1 1 1 1 1
symmnumber: 1
zpe: 1006315.8 jmol-1
zpe.correction: 0.383285 hartree
zpe.thermalcorrener: 0.409940 hartree
zpe.thermalcorrenthalpy: 0.410884 hartree
zpe.thermalcorrgfe: 0.325592 hartree
zpe.sumelectzpe: -1299.801479 hartree
zpe.sumelectthermal: -1299.774825 hartree
zpe.sumelectthermalent: -1299.773881 hartree
zpe.sumelectthermalfe: -1299.859173 hartree
dipole: 2.3951 -2.8519 -0.3392
dipole: 3.7396
quadrupole: -147.7943 -152.9858 -149.9403
quadrupole: 0.4219 -2.9342 -0.6170
quadrupole: 2.4458 -2.7457 0.2999 0.4219 -2.9342 -0.6170
hfenergy: -1300.1847649 hartree
pointgroup: C01 [X(C20H22O7)]
dipole: 0.9340321 -1.1281261 -0.140004 debye
polarizability: 301.6934891|23.0676926|240.2115497|5.4757606|2.9192893|197.122966 unknown
InChI: InChI=1S/C20H22O7/c1-10-18(11-5-16(22-2)19(24-4)17(6-11)23-3)12-7-14-15(26-9-25-14)8-13(12)27-20(10)21/h5-8,10,18,20-21H,9H2,1-4H3
charge 0 multiplicity 1
49 atoms
O  -2.25224 1.961078 -1.453069
O  -0.968882 3.857761 -1.953282
O  -3.807507 -2.355343 1.740017
O  -5.173631 -1.753533 -0.138244
O  2.149833 -1.956229 -1.883819
O  4.448093 1.004053 1.363813
O  4.616665 -1.066584 -0.66828
C  -0.447522 1.355536 0.830922
C  -0.534067 2.775925 0.17095
C  -1.702821 0.544458 0.513346
C  -0.899577 2.586687 -1.305203
C  0.86432 0.643264 0.454437
C  -2.528696 0.876306 -0.595352
C  -1.529351 3.702449 0.900421
C  -2.068943 -0.556447 1.343483
C  -3.717651 0.156148 -0.905372
C  2.064216 1.04082 1.09188
C  0.917172 -0.38211 -0.518974
C  -3.224196 -1.266476 1.030538
C  -4.034099 -0.912037 -0.071746
C  2.150144 -0.973027 -0.865448
C  3.307447 0.468562 0.740699
C  3.365443 -0.530638 -0.272662
C  -4.916079 -2.818951 0.869518
C  2.643759 -3.289411 -1.467162
C  5.407379 0.050843 1.964517
C  5.01744 -0.679726 -2.044621
H  -0.420609 1.529221 1.925445
H  0.472021 3.234584 0.19335
H  -0.190069 1.901361 -1.816383
H  -1.177047 3.904447 1.928485
H  -1.623147 4.661466 0.365019
H  -2.532802 3.246727 0.964179
H  -1.450533 -0.828966 2.203876
H  -4.333879 0.447484 -1.757918
H  2.063457 1.812495 1.869927
H  0.009347 -0.755743 -1.001793
H  -1.236036 3.732299 -2.899038
H  -4.603858 -3.740708 0.341292
H  -5.820273 -2.957023 1.481355
H  2.595735 -3.913472 -2.372554
H  1.983586 -3.709853 -0.684971
H  3.680851 -3.227258 -1.092174
H  6.207829 0.680386 2.382241
H  5.807182 -0.638668 1.203421
H  4.916481 -0.520033 2.776297
H  4.269178 -1.033148 -2.776411
H  5.987877 -1.169987 -2.217254
H  5.128961 0.418109 -2.112496
