program: Gaussian 09
title: 000146584
version: EM64L-G09RevD.01
frameworkgroup: C1[X(C11H11N3O4S)]
method: RPBEPBE
basis: SDD
operation: Freq
keyword: #p
keyword: freq=noraman
keyword: PBEPBE/SDD
title: #p freq=noraman PBEPBE/SDD
converged: YES YES NO NO
title: Mulliken charges:
elementType: S O O O O N N N C C C C C C C C C C C H H H H H H H H H H H
charge: 0.874140 -0.540942 -0.538086 -0.200830 -0.213083 -0.174144 -0.084014 0.043427 -0.751964 0.351628 -0.030898 0.329390 -0.610111 -0.353879 -0.220670 -0.277343 -0.200617 -0.201906 -0.214131 0.317278 0.313951 0.234332 0.292543 0.260288 0.294128 0.276145 0.294446 0.245359 0.244855 0.240708
chargesum: 0.00000
title: Mulliken charges with hydrogens summed into heavy atoms:
elementType: S O O O O N N N C C C C C C C C C C C
charge: 0.874140 -0.540942 -0.538086 -0.200830 -0.213083 -0.174144 -0.084014 0.043427 -0.120735 0.351628 -0.030898 0.329390 0.177053 -0.059752 0.055475 0.017103 0.044742 0.042950 0.026578
polarizability: 2.90603818e+02 8.96062938e+00 1.89954513e+02 2.33848748e+01 4.25908370e+00 1.11746362e+02
1716.lowfreq: -8.5417 -4.8915 -3.9820 0.0014 0.0016 0.0021 11.2174 30.5946 34.9645
frequency: 10.7751 30.4212 34.9328 48.5980 56.3924 86.2543 89.7271 118.4091 149.8499 179.4503 189.1602 217.6170 242.1455 246.2337 255.0023 328.6657 336.6999 362.7479 375.5369 400.9661 405.0033 424.8187 460.8028 518.4681 538.4357 597.3291 601.6399 651.6982 654.3941 690.2952 694.9325 717.4471 742.8903 761.4020 779.0160 785.5223 851.6086 871.9282 877.5450 923.2670 931.0756 937.1433 976.9936 986.1823 1007.4149 1007.5556 1042.5592 1048.9520 1078.3711 1108.6227 1120.8008 1160.3213 1169.8325 1174.4508 1179.8409 1194.7606 1215.4971 1304.8495 1309.8089 1329.1280 1344.4695 1383.4355 1390.4593 1405.1253 1436.7364 1449.3870 1451.9289 1455.2480 1456.9617 1481.0689 1490.2788 1575.7211 1602.8207 3036.0905 3077.0343 3138.7727 3139.3115 3147.8406 3149.2918 3158.0802 3167.4824 3177.1664 3178.6853 3254.9804
redmass: 6.6928 4.3563 5.5070 6.5413 4.3829 3.4698 1.5205 6.4498 6.5160 6.1909 12.6916 4.7933 8.5271 5.7913 6.3145 6.5125 2.6055 4.1949 9.2584 7.1061 2.8609 7.0535 5.4017 5.7130 4.3481 4.9162 6.4826 5.8340 6.6868 2.4138 7.1467 7.3203 9.4885 1.4342 6.4119 8.9100 1.2434 1.7465 1.4825 15.6497 3.2641 1.3646 6.1350 1.3905 4.3115 1.3416 1.5418 1.7246 1.5535 2.8119 1.3391 1.3769 1.3592 1.0633 1.1193 3.1129 4.6808 1.3001 5.1150 4.9049 11.9243 8.3544 1.3787 2.9783 2.2477 1.4741 2.0264 1.1996 2.9561 1.3701 2.3391 5.7862 6.9010 1.0329 1.0581 1.1026 1.0860 1.1028 1.0888 1.0927 1.0970 1.1013 1.1109 1.0996
irintensity: 1.8964 0.6771 0.5198 2.4802 0.7359 3.7224 2.0935 2.6479 1.8085 5.8467 3.8510 4.1401 8.8060 1.0125 0.6999 10.0692 2.7566 5.2025 15.0858 37.9736 0.8760 32.9496 12.8995 68.7085 7.3759 0.4422 0.0333 0.8191 3.2191 31.7018 10.8327 1.3067 15.4643 74.4482 23.8907 48.9702 0.9839 7.4469 22.6941 68.6532 8.4994 1.2685 5.6001 0.2031 1.3473 0.4448 1.6148 37.6350 4.4391 18.1019 0.9239 1.4256 6.1444 1.4813 15.8638 294.7097 39.7862 6.1836 162.6688 47.5213 149.4504 6.1734 11.2552 29.9516 16.0753 11.7595 21.8761 20.2520 106.7083 16.6812 2.0989 4.5477 0.4788 8.3367 1.5438 4.7487 1.6119 6.2719 7.1638 1.8325 7.9901 23.9400 0.5508 2.7954
temp: 298.150 k
press: 1.00000 atm
elementType: 16 8 8 8 8 7 7 7 6 6 6 6 6 6 6 6 6 6 6 1 1 1 1 1 1 1 1 1 1 1
symmnumber: 1
zpe: 557104.3 jmol-1
zpe.correction: 0.212190 hartree
zpe.thermalcorrener: 0.230495 hartree
zpe.thermalcorrenthalpy: 0.231439 hartree
zpe.thermalcorrgfe: 0.162349 hartree
zpe.sumelectzpe: -1287.343019 hartree
zpe.sumelectthermal: -1287.324713 hartree
zpe.sumelectthermalent: -1287.323769 hartree
zpe.sumelectthermalfe: -1287.392860 hartree
dipole: 4.5791 -1.3143 3.3543
dipole: 5.8264
quadrupole: -122.5485 -118.9315 -122.5621
quadrupole: -19.9368 -3.7250 8.5786
quadrupole: -1.2011 2.4158 -1.2147 -19.9368 -3.7250 8.5786
hfenergy: -1287.5552087 hartree
pointgroup: C01 [X(C11H11N3O4S1)]
dipole: 1.7905576 -0.0800102 1.4289846 debye
polarizability: 282.8811521|26.5457405|195.9644307|28.328217|-0.0804694|113.4591094 unknown
InChI: InChI=1S/C11H11N3O4S/c1-13-10(12-7-11(13)14(15)16)8-19(17,18)9-5-3-2-4-6-9/h2-7H,8H2,1H3
charge 0 multiplicity 1
30 atoms
S  1.235806 1.669617 -0.310768
O  1.718806 3.230176 -0.210364
O  0.386845 1.107164 -1.594131
O  -4.236063 -2.459139 -0.295174
O  -4.54711 -0.292602 -0.981655
N  -2.078526 0.414796 0.311659
N  -0.717575 -0.999821 1.493855
N  -3.873113 -1.218335 -0.366787
C  0.038499 1.367346 1.331309
C  -0.908727 0.291233 1.062167
C  2.757953 0.57094 -0.075164
C  -2.645203 -0.866655 0.286662
C  -2.559434 1.634021 -0.37365
C  -1.792243 -1.716171 1.02063
C  2.671647 -0.778664 -0.453798
C  3.914552 1.176914 0.441824
C  3.828898 -1.574382 -0.285992
C  5.060379 0.362462 0.598134
C  5.013311 -1.006019 0.240391
H  0.755621 1.092698 2.115343
H  -0.35762 2.385935 1.448049
H  -1.890126 2.468991 -0.122617
H  -2.532529 1.485482 -1.462847
H  -3.590108 1.861504 -0.065671
H  -1.928127 -2.776563 1.213449
H  1.749364 -1.186493 -0.878634
H  3.920385 2.245123 0.683338
H  3.802855 -2.631801 -0.567947
H  5.984456 0.797767 0.992098
H  5.905229 -1.629522 0.364289
