program: Gaussian 09
title: 000146592
version: EM64L-G09RevD.01
frameworkgroup: C1[X(C19H20O5)]
method: RPBEPBE
basis: SDD
operation: Freq
keyword: #pfreq=noraman
keyword: PBEPBE/SDD
title: #p freq=noraman PBEPBE/SDD
converged: YES YES NO NO
title: Mulliken charges:
elementType: O O O O O C C C C C C C C C C C C C C C C C C C H H H H H H H H H H H H H H H H H H H H
charge: -0.272687 -0.423240 -0.271433 -0.267706 -0.265332 -0.106132 -0.401181 0.184102 0.342690 -0.763383 0.545071 0.142333 -0.735740 -0.508186 -0.515714 0.172728 0.201429 -0.453534 -0.381923 -0.360796 -0.369422 -0.203044 0.308584 -0.538161 0.267592 0.243122 0.258335 0.196066 0.239445 0.227132 0.243151 0.242272 0.274152 0.272154 0.353937 0.235191 0.244154 0.248983 0.239244 0.233826 0.234597 0.221260 0.245236 0.220826
chargesum: 0.00000
title: Mulliken charges with hydrogens summed into heavy atoms:
elementType: O O O O O C C C C C C C C C C C C C C C C C C C
charge: -0.272687 -0.069303 -0.271433 -0.267706 -0.265332 0.161461 -0.158059 0.184102 0.342690 -0.069537 0.545071 0.142333 -0.023184 -0.234033 -0.243559 0.172728 0.201429 -0.218342 -0.137768 -0.111813 -0.130178 0.265380 0.308584 0.149161
polarizability: 2.69012284e+02 -2.14244069e+00 2.41981820e+02 1.16329123e+01 5.20576552e+00 1.61898375e+02
1716.lowfreq: -73.7811 -5.7593 -0.0008 -0.0007 -0.0005 1.3414 8.9360 31.7191 32.5854
frequency: -73.7694 31.5486 32.5576 36.8532 61.2924 79.9689 99.7247 132.6156 153.5262 162.0830 180.2885 215.0370 218.4345 230.3460 236.6096 243.0563 259.9230 268.6670 276.4694 293.1794 302.2047 344.8504 350.4309 361.0320 386.7371 414.0165 430.2097 433.9624 456.2765 483.0971 506.6274 533.4072 537.2226 561.3588 575.2966 629.6452 640.4653 675.8644 680.3046 696.8071 701.9413 735.8867 752.3516 767.6542 775.6583 811.0942 818.6736 832.5212 845.7236 847.0030 853.2879 866.0138 887.2176 907.5189 936.8016 950.0529 962.1535 978.6377 989.2299 1003.0842 1007.8927 1027.3678 1057.7044 1065.5058 1085.9500 1092.3018 1110.9219 1112.6684 1118.8851 1130.2204 1151.0052 1156.6625 1158.0808 1178.3086 1181.5720 1209.6268 1219.9588 1231.2054 1252.3770 1271.2698 1273.0686 1311.3905 1326.6142 1332.3611 1352.9406 1362.6939 1385.1755 1386.0802 1392.3170 1402.1736 1416.4156 1418.8486 1436.5616 1460.1888 1466.6784 1469.9060 1473.2940 1474.2631 1482.0610 1483.6924 1488.7454 1500.9546 1584.0005 1621.9542 1622.6990 1628.6753 2937.4052 2958.5316 2983.9479 2993.8601 3006.5793 3006.8811 3045.5967 3077.2973 3082.5825 3087.2803 3103.4274 3105.2575 3118.5819 3122.9920 3124.6069 3158.3943 3165.2937 3167.0231 3192.1924 3553.5156
redmass: 2.3466 4.4137 5.2171 3.7484 4.8095 3.9553 3.7980 4.5388 4.7074 5.5333 3.2085 1.9496 1.1877 2.9866 1.3110 1.4089 3.7840 1.7325 2.8363 3.0040 4.1435 5.8860 5.2546 3.9200 4.3109 2.9479 3.5480 4.0160 4.2574 3.5656 3.5956 4.0564 5.6132 3.0430 5.1736 6.7471 8.3445 6.2288 9.0026 4.5437 4.4035 3.9596 6.0162 5.0378 4.7284 2.1412 1.6406 1.9895 2.8692 1.9086 3.5665 3.2290 1.4934 1.9121 1.6054 1.6056 1.3615 5.2955 8.5284 2.7392 2.6454 2.8368 1.7047 1.4580 2.0287 2.0219 1.5392 1.2647 1.0365 1.9140 4.2807 1.4526 1.9972 1.9500 1.4263 1.8153 1.3345 3.4142 1.5097 1.8054 7.2068 1.3699 1.3980 1.3943 2.0556 1.3194 3.2226 1.3372 1.2723 5.2704 5.3599 3.3628 1.1777 1.0623 1.0502 2.3359 1.1352 1.0982 1.0559 1.0513 1.2692 2.4214 7.0654 6.4411 10.1674 8.2329 1.0818 1.0330 1.0396 1.0360 1.0809 1.0544 1.1038 1.0966 1.1187 1.0989 1.1000 1.0998 1.0896 1.0934 1.0948 1.0938 1.0949 1.0925 1.0933 1.0651
irintensity: 13.1992 1.2485 0.2356 0.8619 1.7602 0.1599 2.4095 1.8993 2.2072 0.2386 5.5055 5.5749 0.1558 5.4357 7.2280 7.1607 4.3555 67.2093 10.6939 14.1072 14.9872 9.8944 8.4774 19.7082 6.6689 0.3911 2.2646 22.6602 2.4977 5.0884 2.1241 18.8532 21.7772 21.2000 8.7315 1.3311 0.8301 1.8186 0.2924 1.0009 4.7952 1.8399 15.6267 3.3239 9.5029 19.1316 3.1089 25.3331 17.3368 26.9256 21.2560 111.9142 30.3091 57.5653 10.5142 5.4030 0.1245 176.5767 41.9004 18.5628 22.2066 49.4569 21.6950 4.2794 231.4218 65.7627 74.7589 2.6128 0.0631 140.5601 54.5972 7.9422 18.0623 15.0412 49.7208 12.3868 9.5084 175.1341 20.9605 2.9986 136.7098 3.0257 2.9910 14.5447 33.8500 1.7293 28.3108 20.3257 22.3833 96.2143 7.4329 1.5456 11.0238 9.8573 14.0321 212.6982 35.6700 59.0730 4.0938 15.4195 25.4981 117.3757 7.3282 54.5880 8.8956 15.0094 20.5120 66.5717 19.2615 15.5294 26.4014 131.8768 47.5275 35.0752 35.6331 20.2922 17.2430 17.7342 12.6900 41.2808 1.4188 12.4183 6.4540 1.7471 0.3102 10.9908
temp: 298.150 k
press: 1.00000 atm
elementType: 8 8 8 8 8 6 6 6 6 6 6 6 6 6 6 6 6 6 6 6 6 6 6 6 1 1 1 1 1 1 1 1 1 1 1 1 1 1 1 1 1 1 1 1
symmnumber: 1
zpe: 913940.9 jmol-1
zpe.correction: 0.348102 hartree
zpe.thermalcorrener: 0.369497 hartree
zpe.thermalcorrenthalpy: 0.370441 hartree
zpe.thermalcorrgfe: 0.297819 hartree
zpe.sumelectzpe: -1110.345975 hartree
zpe.sumelectthermal: -1110.324580 hartree
zpe.sumelectthermalent: -1110.323635 hartree
zpe.sumelectthermalfe: -1110.396257 hartree
dipole: 0.2877 -0.5375 0.0325
dipole: 0.6106
quadrupole: -132.2391 -131.0959 -136.6756
quadrupole: -6.2788 -10.8516 9.9521
quadrupole: 1.0978 2.2410 -3.3388 -6.2788 -10.8516 9.9521
hfenergy: -1110.6940763 hartree
pointgroup: C01 [X(C19H20O5)]
dipole: -0.1059214 0.2155939 0.0006437 debye
polarizability: 268.9592511|-3.6381373|241.4124606|-11.0386525|-9.1020044|162.5207681 unknown
InChI: InChI=1S/C19H20O5/c1-11-18(12-4-6-13(21-3)7-5-12)14-8-16-17(23-10-22-16)9-15(14)24-19(11,2)20/h4-9,11,18,20H,10H2,1-3H3
charge 0 multiplicity 1
44 atoms
O  2.303367 -1.992646 -0.724907
O  1.378658 -4.118769 -0.926166
O  2.251716 3.44932 0.538504
O  4.157691 2.543088 -0.618466
O  -5.349809 1.384628 -0.086163
C  -0.072676 -2.398924 -0.102428
C  -0.153529 -1.040447 0.666655
C  1.363847 -2.963659 -0.062962
C  1.027168 -0.126382 0.305647
C  -1.108419 -3.419837 0.410589
C  -1.5127 -0.371032 0.44115
C  2.176803 -0.638159 -0.355791
C  1.939176 -3.288175 1.32576
C  0.991676 1.258848 0.649013
C  3.281997 0.183678 -0.717939
C  2.077672 2.056599 0.301176
C  3.198084 1.529822 -0.375623
C  -2.466619 -0.288571 1.488099
C  -1.867373 0.16106 -0.822118
C  -3.73047 0.298218 1.28674
C  -3.129241 0.753462 -1.047134
C  3.567859 3.790615 -0.056887
C  -4.067561 0.820469 0.0142
C  -5.744244 1.940525 -1.382046
H  -0.270518 -2.204319 -1.175336
H  -0.088722 -1.274835 1.751601
H  -0.991617 -4.381273 -0.115636
H  -0.99871 -3.599113 1.49721
H  -2.13141 -3.044745 0.236745
H  2.968393 -3.675312 1.217379
H  1.985091 -2.391297 1.967041
H  1.325446 -4.056604 1.824962
H  0.11671 1.679774 1.151521
H  4.143311 -0.245189 -1.233243
H  2.31882 -4.408204 -1.052214
H  -2.216251 -0.690267 2.477903
H  -1.140936 0.128618 -1.643164
H  -4.466553 0.364173 2.093664
H  -3.365754 1.156618 -2.03657
H  3.41763 4.513824 -0.877946
H  4.234828 4.174356 0.734591
H  -5.077425 2.771459 -1.684906
H  -6.765281 2.321267 -1.232577
H  -5.748127 1.162638 -2.17053
