program: Gaussian 09
title: 000146575
version: EM64L-G09RevD.01
frameworkgroup: C1[X(C13H12N4O2)]
method: RPBEPBE
basis: SDD
operation: Freq
keyword: #p
keyword: freq=noraman
keyword: PBEPBE/SDD
title: #p freq=noraman PBEPBE/SDD
converged: YES YES NO NO
title: Mulliken charges:
elementType: O O N N N N C C C C C C C C C C C C C H H H H H H H H H H H H
charge: -0.236814 -0.252869 -0.179229 -0.038889 -0.283678 -0.019502 0.286294 -0.125423 0.372993 0.080160 -0.090443 -0.342569 -0.311171 -0.635496 -0.329944 -0.181595 -0.374250 0.285336 -0.738644 0.242055 0.261278 0.234595 0.244042 0.279200 0.279010 0.340794 0.229832 0.239789 0.254989 0.253228 0.256920
chargesum: 0.00000
title: Mulliken charges with hydrogens summed into heavy atoms:
elementType: O O N N N N C C C C C C C C C C C C C
charge: -0.236814 -0.252869 -0.179229 -0.038889 0.057115 -0.019502 0.286294 -0.125423 0.372993 0.080160 -0.090443 -0.100514 -0.049892 0.122341 -0.050933 0.048237 -0.134461 0.285336 0.026493
polarizability: 3.14127755e+02 1.32991720e+01 1.91897460e+02 -7.79576801e+00 1.07549946e+01 9.56199099e+01
1716.lowfreq: 0.0005 0.0006 0.0008 0.5311 4.0474 5.8052 24.5719 39.8537 49.3976
frequency: 24.5329 39.8481 49.3765 54.6978 93.2854 109.6653 143.3938 164.7524 175.3545 198.9466 207.2969 241.2389 283.7165 307.5932 331.4483 369.1291 415.3731 424.5403 452.2316 511.0255 524.9661 549.8166 562.5247 573.9539 574.8110 604.2666 655.1679 667.1963 674.9676 715.5450 721.3778 769.7116 789.5991 829.0846 830.5751 839.3260 862.1417 877.4244 943.5345 965.5391 967.1881 990.5775 994.6316 998.2129 1026.2915 1040.3905 1056.2789 1126.2695 1130.5587 1148.4397 1171.9841 1184.7027 1216.7388 1233.4617 1259.4084 1305.4040 1340.0668 1350.3108 1370.0646 1384.6491 1396.3370 1401.6603 1416.2863 1424.9660 1454.6213 1455.5079 1456.9035 1475.3052 1480.6753 1492.3533 1516.6675 1566.2672 1585.6446 1621.8845 1648.3902 2995.1779 3009.5725 3083.3856 3101.1898 3120.8029 3123.2187 3137.8630 3146.0031 3149.4734 3170.5662 3173.9573 3292.4375
redmass: 3.3988 4.7998 1.4430 4.0132 3.6823 3.2662 1.1661 5.2439 4.5329 4.5711 4.2716 4.5688 4.2472 4.6209 5.1171 4.2717 5.6342 3.8547 5.3673 6.6405 4.6446 5.5627 3.6735 6.2988 3.4207 4.5313 7.5138 5.3358 5.0271 5.9268 3.7133 7.6584 1.7524 4.1408 1.6788 3.5991 5.2402 4.9104 1.4202 2.0005 1.3353 2.0841 1.3710 3.0146 2.5239 1.5921 2.7899 1.3188 1.2368 1.6643 3.1889 1.9007 2.8800 2.3465 3.0645 2.1047 3.8195 2.3756 2.2051 1.2154 3.1316 1.9700 3.2597 2.3540 1.1194 1.0592 1.7075 1.4970 1.1931 2.0499 4.7685 6.1500 7.7196 7.9208 8.8539 1.0344 1.0360 1.1022 1.0979 1.1003 1.0893 1.1012 1.0888 1.0899 1.1000 1.0965 1.0751
irintensity: 1.3802 1.8771 1.8612 1.1951 4.6316 4.0798 1.1266 0.8457 1.3508 0.5975 19.1907 5.3266 7.5257 0.5947 16.7064 3.9410 34.5560 0.9537 5.2079 1.3161 15.4606 40.1302 8.9565 6.5411 19.2572 11.5168 26.0804 93.7360 18.5447 38.4682 9.0331 0.6227 9.2230 45.2455 101.1927 0.2260 98.0168 12.2532 0.0712 80.4885 1.5514 9.8712 0.7568 21.4557 0.2070 17.8970 10.1661 4.8445 3.1533 16.9354 382.1114 35.8462 5.1979 3.1665 2.7818 24.1305 1.1434 12.7606 15.0358 31.3725 34.0184 37.4834 2.2435 6.7675 11.6435 10.5425 64.1149 13.1569 7.6028 10.2642 30.9705 0.4225 38.1462 2.7624 295.2568 44.1593 3.0164 19.1219 4.4739 0.9050 23.1384 7.1413 4.4686 11.1708 23.6624 7.8350 66.2675
temp: 298.150 k
press: 1.00000 atm
elementType: 8 8 7 7 7 7 6 6 6 6 6 6 6 6 6 6 6 6 6 1 1 1 1 1 1 1 1 1 1 1 1
symmnumber: 1
zpe: 612019.8 jmol-1
zpe.correction: 0.233106 hartree
zpe.thermalcorrener: 0.249710 hartree
zpe.thermalcorrenthalpy: 0.250654 hartree
zpe.thermalcorrgfe: 0.187089 hartree
zpe.sumelectzpe: -870.672237 hartree
zpe.sumelectthermal: -870.655633 hartree
zpe.sumelectthermalent: -870.654689 hartree
zpe.sumelectthermalfe: -870.718254 hartree
dipole: 2.5640 2.5480 1.6610
dipole: 3.9781
quadrupole: -107.9694 -97.4917 -111.2068
quadrupole: 13.0012 11.7639 -2.4362
quadrupole: -2.4134 8.0642 -5.6508 13.0012 11.7639 -2.4362
hfenergy: -870.905343 hartree
pointgroup: C01 [X(C13H12N4O2)]
dipole: -0.9846512 0.7281368 -0.9746006 debye
polarizability: 314.3695407|-12.5180081|175.0203978|3.8583201|-38.3791838|112.2551859 unknown
InChI: InChI=1S/C13H12N4O2/c1-8(18)19-16-13-15-12-9-4-3-7-14-10(9)5-6-11(12)17(13)2/h3-7,16H,1-2H3
charge 0 multiplicity 1
31 atoms
O  -3.639499 -0.041268 -0.233892
O  -4.574924 -1.660586 1.159925
N  -0.910227 1.489771 -0.0331
N  -0.490734 -0.55439 0.932263
N  -2.78248 0.332258 1.013769
N  4.406245 -0.178445 -0.125919
C  0.459591 1.258318 -0.176147
C  0.703381 -0.003436 0.449691
C  2.031394 -0.538868 0.499306
C  -1.434067 0.371145 0.635329
C  3.084389 0.246154 -0.113609
C  1.491925 2.02933 -0.783643
C  2.786403 1.512417 -0.740697
C  -1.667437 2.665349 -0.469994
C  2.375791 -1.782993 1.105958
C  3.71234 -2.196287 1.087089
C  4.689772 -1.36135 0.460116
C  -4.538775 -1.0886 0.046458
C  -5.407206 -1.372276 -1.156697
H  1.284972 2.990332 -1.265443
H  3.630126 2.049921 -1.183488
H  -1.136696 3.587615 -0.177691
H  -1.815334 2.660807 -1.564358
H  -2.651336 2.639817 0.023061
H  1.589329 -2.385009 1.571595
H  -2.980065 -0.438843 1.687514
H  4.020294 -3.143068 1.541607
H  5.742186 -1.669141 0.435489
H  -6.464819 -1.203582 -0.889034
H  -5.137349 -0.733882 -2.010414
H  -5.298789 -2.43411 -1.436143
