program: Gaussian 09
title: 000010102
version: EM64L-G09RevD.01
frameworkgroup: C1[X(C15H24)]
method: RPBEPBE
basis: SDD
operation: Freq
keyword: #p
keyword: freq=noraman
keyword: PBEPBE/SDD
title: #p freq=noraman PBEPBE/SDD
converged: NO YES NO NO
title: Mulliken charges:
elementType: C C C C C C C C C C C C C C C H H H H H H H H H H H H H H H H H H H H H H H H
charge: 0.355067 -0.080388 0.425430 -0.659578 0.224263 -0.542219 -0.479782 -0.465785 -0.454969 -0.432487 -0.338561 -0.267094 -0.783634 -0.744106 -0.758773 0.176903 0.219563 0.197550 0.203467 0.214877 0.214039 0.194380 0.197117 0.188894 0.188055 0.197685 0.196440 0.210487 0.243664 0.231776 0.211086 0.213062 0.210512 0.225299 0.209194 0.217255 0.211564 0.208748 0.220999
chargesum: 0.00000
title: Mulliken charges with hydrogens summed into heavy atoms:
elementType: C C C C C C C C C C C C C C C
charge: 0.355067 0.096515 0.425430 -0.242465 0.224263 -0.123875 -0.071363 -0.079774 -0.069229 -0.025559 -0.094897 -0.035318 -0.148975 -0.092359 -0.117462
polarizability: 1.78520656e+02 3.31664063e+00 1.39151791e+02 -2.24501422e+00 -3.45918346e+00 1.34516337e+02
1716.lowfreq: -31.0108 -15.9473 -7.8104 -0.0008 -0.0001 0.0002 78.6154 123.3590 149.1184
frequency: 78.5447 123.2658 149.0668 188.8114 193.0872 203.6384 222.3196 231.8208 250.0486 271.3165 301.6516 307.1750 311.4748 342.5657 366.7038 379.2549 425.3861 427.1348 462.1047 498.8274 518.8220 547.1335 570.9625 582.9772 675.9901 702.3067 726.9336 757.3076 803.2692 811.6735 841.3236 851.7986 866.9123 885.1664 901.3849 923.5893 931.5561 946.6943 958.0907 967.6475 991.7244 993.6710 1010.3371 1016.9605 1029.0444 1040.9168 1080.4859 1085.8786 1096.8852 1106.6866 1127.9653 1147.3633 1147.9608 1184.3893 1195.4649 1197.0763 1205.7607 1228.5600 1234.6630 1268.3916 1281.8016 1294.2769 1295.8037 1311.5669 1319.7048 1325.4402 1330.3213 1341.7060 1346.1951 1352.0151 1366.7357 1370.1711 1382.2779 1390.4562 1448.9184 1453.6246 1456.9432 1461.2744 1465.6472 1468.0367 1470.3647 1473.3347 1476.2348 1480.1083 1485.3893 1501.4666 1601.9334 2914.3917 2948.6830 2950.9171 2954.3497 2957.8922 2961.8410 2964.5508 2973.0579 2978.0448 2988.4345 3002.7771 3010.2835 3016.4923 3033.6646 3048.9232 3052.7916 3054.7325 3057.6678 3060.3777 3066.8277 3068.9295 3090.0063 3109.0903 3143.7845
redmass: 2.9367 2.5625 2.4050 1.2682 1.3581 1.1537 1.6318 1.7629 2.0053 2.4348 2.8870 2.3350 2.2190 2.4292 2.4770 2.3941 2.4425 2.4720 2.8848 1.8247 3.8209 2.8027 3.1460 3.1651 2.0974 3.8296 2.7916 1.4373 2.0865 1.8813 1.6943 2.1418 2.4523 2.2157 1.9854 1.5251 1.6990 1.3494 1.6068 1.8976 1.5895 1.8651 1.8252 2.1224 1.4841 1.9626 1.3462 1.3620 2.0491 1.5147 2.0670 3.1903 1.7379 2.0114 1.8881 2.3596 1.5596 2.3827 2.4736 1.8028 1.7268 1.5096 1.4622 1.2836 1.3934 1.4131 1.6299 1.4361 1.4933 1.4050 1.3395 1.2743 1.2145 1.2312 1.0803 1.0816 1.0772 1.0588 1.0815 1.0617 1.0579 1.0600 1.0797 1.0605 1.0604 1.0854 7.1864 1.0815 1.0599 1.0599 1.0551 1.0585 1.0498 1.0350 1.0384 1.0651 1.0664 1.1005 1.0996 1.1017 1.0933 1.0984 1.0986 1.0993 1.0988 1.0985 1.0946 1.0976 1.0971 1.0846 1.1058
irintensity: 0.0073 0.0023 0.0715 0.0357 0.0735 0.0298 0.0463 0.1582 0.1825 0.1328 0.3096 0.3692 1.1938 0.4431 0.5870 0.1399 0.0825 0.1646 1.3192 1.4149 0.1884 0.1811 0.6792 0.1329 0.2837 1.2478 1.2550 45.9216 0.3505 7.5994 2.2876 0.6481 2.1770 2.9784 4.4716 0.4874 8.9628 0.9459 4.6143 4.0381 4.7858 4.2335 3.3099 0.9849 4.4668 1.3284 2.7572 6.1651 0.2798 0.7220 2.3970 1.1445 0.1129 7.8668 6.0340 0.7326 2.4345 3.6872 2.6225 0.0853 0.7730 1.0160 1.3508 0.6073 1.2511 2.6490 1.7973 0.8546 3.9771 2.4280 13.2259 8.4354 12.5004 10.2031 1.2571 0.6177 3.6963 3.3037 5.9471 9.9262 8.6303 14.3573 8.2086 10.0518 19.6673 8.8588 3.0890 26.8968 23.6751 14.2792 8.6189 55.2515 124.6744 31.4946 30.9379 71.3226 50.9345 11.7505 52.8405 27.9728 29.9455 38.4487 48.0837 4.8823 65.7963 67.0083 19.2233 78.6051 34.1383 8.3224 42.5673
temp: 298.150 k
press: 1.00000 atm
elementType: 6 6 6 6 6 6 6 6 6 6 6 6 6 6 6 1 1 1 1 1 1 1 1 1 1 1 1 1 1 1 1 1 1 1 1 1 1 1 1
symmnumber: 1
zpe: 922656.9 jmol-1
zpe.correction: 0.351421 hartree
zpe.thermalcorrener: 0.365935 hartree
zpe.thermalcorrenthalpy: 0.366879 hartree
zpe.thermalcorrgfe: 0.312593 hartree
zpe.sumelectzpe: -584.795420 hartree
zpe.sumelectthermal: -584.780906 hartree
zpe.sumelectthermalent: -584.779962 hartree
zpe.sumelectthermalfe: -584.834248 hartree
dipole: 0.1912 -0.0466 0.3091
dipole: 0.3664
quadrupole: -93.5714 -93.8823 -94.7106
quadrupole: 0.8561 -0.1208 -1.1225
quadrupole: 0.4834 0.1725 -0.6558 0.8561 -0.1208 -1.1225
hfenergy: -585.1468412 hartree
pointgroup: C01 [X(C15H24)]
dipole: -0.0783165 0.0303255 0.1171817 debye
polarizability: 178.3145931|3.9830089|139.9393888|2.8411386|2.9976692|133.9348013 unknown
InChI: InChI=1S/C15H24/c1-13(2)9-10-15-7-4-6-14(3,11-15)8-5-12(13)15/h9-10,12H,4-8,11H2,1-3H3
charge 0 multiplicity 1
39 atoms
C  0.085128 -0.699915 -0.528197
C  0.78174 0.632167 -0.068147
C  -2.165571 0.435335 -0.278934
C  -1.199453 -0.278087 -1.28217
C  2.312709 0.320678 0.08396
C  -0.016961 1.398647 0.992152
C  -0.340835 -1.749205 0.567705
C  -1.454907 1.642545 0.432973
C  -2.659883 -0.634039 0.739366
C  -1.513377 -1.342659 1.498332
C  1.233022 -1.327235 -1.319868
C  2.438394 -0.817395 -0.944265
C  -3.392841 0.986236 -1.047029
C  2.742754 -0.137903 1.506436
C  3.175437 1.546704 -0.318573
H  0.739995 1.265626 -0.984519
H  -0.943119 0.402528 -2.118963
H  -1.720991 -1.156134 -1.718219
H  0.451486 2.382923 1.197719
H  -0.038315 0.858532 1.953729
H  0.534604 -2.042667 1.175202
H  -0.638619 -2.662003 0.008631
H  -2.119032 2.014828 1.239667
H  -1.381593 2.461924 -0.313181
H  -3.245279 -1.389951 0.174706
H  -3.359731 -0.167597 1.462586
H  -1.906275 -2.252609 1.994577
H  -1.145778 -0.691365 2.309911
H  1.086907 -2.157126 -2.021969
H  3.414493 -1.163495 -1.306926
H  -4.099904 1.492754 -0.361429
H  -3.085555 1.718989 -1.817327
H  -3.942397 0.170557 -1.555204
H  2.156882 -1.002787 1.859884
H  3.810482 -0.428522 1.513148
H  2.614641 0.686038 2.234312
H  2.991202 2.39825 0.364624
H  4.254837 1.306524 -0.271018
H  2.943602 1.874811 -1.348484
