program: Gaussian 09
title: 000146573
version: EM64L-G09RevD.01
frameworkgroup: C1[X(C16H9NO3)]
method: RPBEPBE
basis: SDD
operation: Freq
keyword: #p
keyword: freq=noraman
keyword: PBEPBE/SDD
title: #p freq=noraman PBEPBE/SDD
converged: YES YES YES YES
title: Mulliken charges:
elementType: O O O N C C C C C C C C C C C C C C C C H H H H H H H H H
charge: -0.425618 -0.212091 -0.215900 0.017647 -0.475390 0.254853 0.324357 0.284723 0.240370 0.391862 -0.404670 0.260532 -0.432543 -0.565712 -0.397848 -0.388309 -0.416877 -0.201642 0.311664 -0.400637 0.262086 0.253741 0.279920 0.254352 0.302105 0.285682 0.229443 0.224789 0.359112
chargesum: 0.00000
title: Mulliken charges with hydrogens summed into heavy atoms:
elementType: O O O N C C C C C C C C C C C C C C C C
charge: -0.066506 -0.212091 -0.215900 0.017647 -0.475390 0.254853 0.324357 0.284723 0.240370 0.391862 -0.142584 0.260532 -0.178802 -0.285792 -0.143496 -0.086204 -0.131195 0.027801 0.311664 -0.175848
polarizability: 3.63090323e+02 3.08518146e+00 2.32071113e+02 -1.39268034e-02 2.32535473e-03 7.00854971e+01
1716.lowfreq: -8.1338 -5.7834 -4.2887 -0.0005 0.0003 0.0009 30.0142 54.8192 89.0987
frequency: 30.0087 54.8152 89.0977 137.5878 142.6503 181.3815 209.9135 232.2676 281.8864 308.3888 340.2763 348.0643 359.3962 375.6436 431.7696 441.2337 460.8959 466.6282 508.9953 549.0509 564.7170 576.5249 584.2601 597.7654 620.5793 659.5564 689.0750 697.1064 705.4601 763.4597 775.8098 785.2657 803.1272 813.1136 831.7127 839.7551 871.2823 897.3886 933.3745 941.0527 956.1351 986.4059 991.0474 999.6089 1038.3891 1078.9578 1100.3864 1126.9011 1142.8920 1154.2247 1186.1516 1193.7832 1204.4856 1228.2889 1232.1568 1286.8496 1288.9434 1330.2891 1351.8228 1388.7894 1396.5766 1407.8781 1434.9994 1447.3485 1471.3778 1476.3341 1501.8844 1584.8914 1595.5593 1614.2852 1619.3551 1630.1924 3120.8231 3134.8692 3149.6697 3150.9121 3155.2561 3164.9649 3180.9527 3213.5978 3583.9313
redmass: 14.1499 7.7005 5.6759 7.5338 4.6934 4.0373 5.0529 8.7595 7.5695 4.9479 6.9393 5.2192 1.1265 7.7420 6.1054 3.2429 3.2841 5.0089 6.9070 6.7899 5.5386 6.6927 3.4303 6.5341 5.4201 3.3233 7.0345 5.9875 8.7983 2.4792 6.7282 3.0790 1.4258 6.6123 2.2077 6.8950 1.4243 1.6902 1.4014 1.4432 3.5148 6.0350 1.3688 1.3536 2.5975 2.3229 2.0607 2.0560 1.4852 1.6099 1.7130 1.9272 2.3626 1.9738 2.4409 2.3446 1.9762 2.9051 4.9677 2.6942 4.3841 3.5850 4.2967 3.9917 5.2015 4.0179 4.2699 7.2846 8.3973 7.7426 7.4093 7.3328 1.0887 1.0882 1.0957 1.0909 1.0954 1.0932 1.0934 1.0937 1.0661
irintensity: 0.0552 0.1044 0.6190 0.8483 10.7872 1.2841 0.0625 2.8789 0.1559 0.0314 11.8324 0.2415 145.0845 2.0965 1.0811 1.1298 0.4857 1.9809 2.0069 2.0413 2.9498 0.2456 10.0752 6.0195 8.8981 0.8942 0.4499 2.8056 7.1252 10.5534 13.9545 9.0219 90.0686 38.0500 21.1332 26.7407 51.7374 8.4248 0.3627 1.2297 7.2800 8.2760 1.0979 2.2307 3.9598 47.2388 64.4994 104.7569 168.2167 6.3323 205.5732 172.2332 155.9022 57.0555 2.0633 12.3465 61.5124 34.4317 62.2794 39.9288 41.6025 8.1432 23.6091 12.1677 4.5852 38.5397 80.4188 31.9232 51.1219 25.3696 0.8226 59.1550 18.1207 9.1893 11.5897 6.6925 24.0214 2.6511 1.6660 6.5062 74.9611
temp: 298.150 k
press: 1.00000 atm
elementType: 8 8 8 7 6 6 6 6 6 6 6 6 6 6 6 6 6 6 6 6 1 1 1 1 1 1 1 1 1
symmnumber: 1
zpe: 545512.1 jmol-1
zpe.correction: 0.207775 hartree
zpe.thermalcorrener: 0.222327 hartree
zpe.thermalcorrenthalpy: 0.223271 hartree
zpe.thermalcorrgfe: 0.165775 hartree
zpe.sumelectzpe: -894.125098 hartree
zpe.sumelectthermal: -894.110546 hartree
zpe.sumelectthermalent: -894.109602 hartree
zpe.sumelectthermalfe: -894.167098 hartree
dipole: -7.2496 2.1848 0.0004
dipole: 7.5717
quadrupole: -118.9792 -101.7504 -118.3562
quadrupole: -0.9318 0.0012 0.0034
quadrupole: -5.9506 11.2782 -5.3276 -0.9318 0.0012 0.0034
hfenergy: -894.332873 hartree
pointgroup: C01 [X(C16H9N1O3)]
dipole: -2.8504095 0.8655949 0.0001717 debye
polarizability: 363.1027654|2.8085631|232.0586709|-0.0139219|0.0023548|70.0854971 unknown
InChI: InChI=1S/C16H9NO3/c18-9-4-5-10-11-2-1-3-13-15(17(19)20)7-6-12(16(11)13)14(10)8-9/h1-8,18H
charge 0 multiplicity 1
29 atoms
O  -5.244542 -1.662593 0.000149
O  4.582205 -2.013402 0.000186
O  4.70684 0.255875 -0.000767
N  4.025372 -0.844546 -0.000215
C  0.416908 0.355427 0.000006
C  -0.291862 -0.893071 -0.000035
C  -0.504169 1.455665 0.00012
C  -1.735803 -0.56648 0.000058
C  -1.86534 0.870299 0.00015
C  1.833632 0.494186 -0.000071
C  0.442325 -2.084468 -0.00013
C  2.545439 -0.767294 -0.000146
C  0.007141 2.755029 0.000179
C  -2.863945 -1.399561 0.000063
C  -3.142233 1.455231 0.00025
C  2.333905 1.846919 -0.000017
C  1.864215 -2.001874 -0.000168
C  1.432447 2.923586 0.000115
C  -4.145095 -0.789338 0.00017
C  -4.288398 0.621471 0.000258
H  -0.039801 -3.06679 -0.000166
H  -0.643556 3.635884 0.00027
H  -2.797119 -2.491038 -0.000012
H  -3.267109 2.542955 0.00032
H  3.408649 2.026017 -0.000101
H  2.4699 -2.912154 -0.000217
H  1.838351 3.941374 0.000162
H  -5.290096 1.069743 0.00033
H  -6.09836 -1.16295 0.000159
