program: Gaussian 09
title: 000146577
version: EM64L-G09RevD.01
frameworkgroup: C1[X(C11H11N5O4S)]
method: RPBEPBE
basis: SDD
operation: Freq
keyword: #p
keyword: freq=noraman
keyword: PBEPBE/SDD
title: #p freq=noraman PBEPBE/SDD
converged: NO YES NO NO
title: Mulliken charges:
elementType: S O O O O N N N N N C C C C C C C C C C C H H H H H H H H H H H
charge: 1.010016 -0.597873 -0.466878 -0.538165 -0.539225 -0.160472 0.026843 -0.323677 0.054133 0.008786 0.335358 -0.067038 -0.015069 -0.026743 -0.329986 0.047283 -0.291463 -0.643699 0.186809 -0.407962 -0.407222 0.260660 0.270794 0.308091 0.281190 0.223880 0.301004 0.298131 0.233597 0.232087 0.369593 0.367217
chargesum: 0.00000
title: Mulliken charges with hydrogens summed into heavy atoms:
elementType: S O O O O N N N N N C C C C C C C C C C C
charge: 1.010016 -0.228280 -0.099661 -0.538165 -0.539225 -0.160472 0.026843 -0.022672 0.054133 0.008786 0.335358 -0.067038 -0.015069 -0.026743 -0.069326 0.047283 -0.020669 0.169461 0.186809 -0.109832 0.058463
polarizability: 5.03919065e+02 -4.10452703e+01 2.17485917e+02 -8.78932116e+00 -4.36674262e+00 1.22983112e+02
1716.lowfreq: -4.4739 -1.3958 0.0007 0.0013 0.0024 4.3016 21.3486 35.9427 38.8806
frequency: 21.3280 35.8916 38.8341 57.4885 79.8705 90.0050 97.2939 114.6193 129.9721 132.7032 141.4584 184.1220 188.6566 223.6570 230.6097 248.3609 254.2577 271.2370 283.1534 288.8808 313.3568 340.4794 380.3695 394.4746 404.7825 444.3501 448.4409 504.6633 530.2640 553.7255 561.0808 582.9643 596.9761 646.0008 661.0998 708.5294 717.1618 724.8673 781.9261 807.3330 816.1990 839.6591 853.1937 866.5170 881.1835 914.0584 928.0616 975.2194 984.8725 1008.8815 1013.7769 1035.8874 1042.2616 1073.4521 1120.8916 1134.7675 1147.5000 1188.4552 1193.4633 1194.3791 1222.9495 1259.0870 1269.0674 1287.2308 1314.7950 1366.4318 1374.1404 1390.4290 1406.1228 1435.5845 1450.1431 1458.6339 1464.8510 1473.4474 1479.7176 1518.3377 1525.5094 1569.9986 1595.6164 2948.6719 2998.0137 3003.7235 3099.7356 3132.3515 3157.9638 3178.0100 3188.7887 3372.3868 3469.4555 3599.2151
redmass: 9.9378 9.2447 8.4696 4.2476 4.9714 6.9738 5.4963 6.6989 2.0761 2.1823 2.1495 2.4906 2.0193 4.3689 4.5685 3.3405 1.9353 3.9425 2.7465 4.8668 4.7632 4.6379 7.8775 10.1274 7.0718 6.5484 5.1396 15.7633 7.0391 3.9319 5.9194 4.2762 4.5720 9.7061 5.4340 8.0523 5.5066 3.5845 7.4549 14.6264 3.3677 2.4402 3.8224 1.4888 5.3277 3.6450 1.3212 1.3434 3.7598 1.8485 3.9370 2.4057 1.5099 3.2564 1.3496 1.5372 1.4053 2.7636 1.7577 1.0725 2.8058 3.0891 3.8786 2.3344 3.6965 2.2185 2.9452 3.3932 2.3163 1.8808 1.4351 1.4093 1.4097 4.3945 1.0562 5.7319 6.5651 7.1903 7.2230 1.0554 1.1046 1.0339 1.1027 1.1008 1.0879 1.0983 1.0931 1.0754 1.0661 1.0669
irintensity: 0.3140 1.4367 1.9227 6.7586 12.4388 3.9992 8.3319 28.3146 3.6339 9.7700 16.7452 77.2050 43.6224 7.2561 24.6161 13.5011 77.3438 15.1926 82.9829 13.8211 14.2909 8.2227 40.7142 19.1904 3.3808 6.3808 16.9169 261.6059 7.4161 2.7617 7.9240 6.7836 2.8180 10.8205 2.3341 1.7358 7.3424 4.4207 19.6563 74.6262 19.9568 20.7466 18.2144 80.9591 27.6771 5.8601 16.1128 0.6891 41.4427 2.7104 113.8777 0.6962 60.5658 5.5802 2.4735 28.1318 90.5756 44.7171 6.6946 0.2870 18.7265 2.9753 82.7106 28.0452 38.2385 58.4297 1.6934 156.4665 17.5684 51.4159 31.0263 24.5315 3.2707 7.4898 23.0555 79.9100 2.3600 25.9348 67.9291 26.3152 25.8685 18.4272 10.6978 0.5410 2.9264 5.4748 0.6356 27.1375 97.4997 19.1123
temp: 298.150 k
press: 1.00000 atm
elementType: 16 8 8 8 8 7 7 7 7 7 6 6 6 6 6 6 6 6 6 6 6 1 1 1 1 1 1 1 1 1 1 1
symmnumber: 1
zpe: 576829.3 jmol-1
zpe.correction: 0.219703 hartree
zpe.thermalcorrener: 0.240522 hartree
zpe.thermalcorrenthalpy: 0.241466 hartree
zpe.thermalcorrgfe: 0.168424 hartree
zpe.sumelectzpe: -1396.773717 hartree
zpe.sumelectthermal: -1396.752898 hartree
zpe.sumelectthermalent: -1396.751954 hartree
zpe.sumelectthermalfe: -1396.824996 hartree
dipole: -4.2992 2.4270 2.5425
dipole: 5.5532
quadrupole: -122.8065 -114.7790 -134.7196
quadrupole: 28.5749 3.8876 -4.5532
quadrupole: 1.2952 9.3227 -10.6179 28.5749 3.8876 -4.5532
hfenergy: -1396.9934201 hartree
pointgroup: C01 [X(C11H11N5O4S1)]
dipole: 1.7352206 -0.861892 1.0096936 debye
polarizability: 507.2268367|-7.6784039|209.1906436|30.8363322|15.5807849|127.970613 unknown
InChI: InChI=1S/C11H10N5O.HO3S/c1-16-8-3-2-7-9(10(8)15-11(16)12)14-6(5-17)4-13-7;1-4(2)3/h2-4,12,17H,5H2,1H3;1H
charge 0 multiplicity 1
32 atoms
S  -4.469347 0.640339 -0.732143
O  -5.663942 -0.795569 -0.444865
O  5.521899 2.555446 0.422207
O  -3.380876 0.088826 -1.818504
O  -5.428215 1.883071 -1.187272
N  -1.77798 -1.439449 0.323908
N  -0.829927 0.606946 0.913037
N  -3.229894 0.192857 1.320209
N  2.132297 1.189047 0.567242
N  3.650836 -0.916546 -0.659094
C  -0.450637 -1.502299 -0.007508
C  0.123866 -0.220709 0.397582
C  1.538558 0.010106 0.194272
C  -2.009774 -0.143558 0.885641
C  0.310302 -2.537622 -0.622188
C  2.295947 -1.05615 -0.425375
C  1.666186 -2.300427 -0.820162
C  -2.817312 -2.447022 0.073835
C  3.463274 1.307578 0.324426
C  4.219316 0.255334 -0.284442
C  4.094026 2.618729 0.735826
H  -0.152637 -3.47812 -0.933471
H  2.314839 -3.048506 -1.286301
H  -3.722619 -2.157061 0.627174
H  -3.068169 -2.466339 -1.000445
H  -2.469738 -3.43867 0.409274
H  -3.227896 1.148396 1.732209
H  5.288911 0.385759 -0.458986
H  3.583152 3.440658 0.190886
H  3.913196 2.771653 1.82091
H  -6.529755 -0.504185 -0.856945
H  5.954412 3.413486 0.652465
