program: Gaussian 09
title: 000146610
version: EM64L-G09RevD.01
frameworkgroup: C1[X(C21H24O7)]
method: RPBEPBE
basis: SDD
operation: Freq
keyword: #pfreq=noraman
keyword: PBEPBE/SDD
title: #p freq=noraman PBEPBE/SDD
converged: YES YES NO NO
title: Mulliken charges:
elementType: O O O O O O O C C C C C C C C C C C C C C C C C C C C C H H H H H H H H H H H H H H H H H H H H H H H H
charge: -0.272185 -0.422532 -0.272599 -0.267199 -0.290630 -0.305027 -0.308912 -0.109674 -0.412991 0.181694 0.347883 0.667478 -0.759785 0.145452 -0.735650 -0.508534 -0.516287 -0.557938 -0.675677 0.173649 0.201370 0.254716 0.273445 -0.004835 -0.203273 -0.524576 -0.528249 -0.524840 0.274085 0.250305 0.197587 0.238092 0.258117 0.227457 0.243206 0.242824 0.271522 0.272557 0.354465 0.272142 0.262041 0.233354 0.235403 0.228426 0.262875 0.213747 0.251879 0.228999 0.223556 0.255506 0.226137 0.231428
chargesum: 0.00000
title: Mulliken charges with hydrogens summed into heavy atoms:
elementType: O O O O O O O C C C C C C C C C C C C C C C C C C C C C
charge: -0.272185 -0.068067 -0.272599 -0.267199 -0.290630 -0.305027 -0.308912 0.164410 -0.162686 0.181694 0.347883 0.667478 -0.065990 0.145452 -0.022163 -0.237012 -0.243730 -0.285796 -0.413636 0.173649 0.201370 0.254716 0.273445 -0.004835 0.265483 0.180471 0.176185 0.188232
polarizability: 3.04163354e+02 3.35497811e+00 2.66714431e+02 1.54159468e+01 3.93338178e+00 2.02114334e+02
1716.lowfreq: -64.9907 -6.8310 -0.0008 -0.0005 -0.0004 3.8406 5.4159 18.2118 29.1525
frequency: -64.9748 18.1606 29.1406 30.8100 57.9375 71.2522 75.7026 83.2873 86.7389 93.9089 126.6362 139.6829 148.2563 159.1158 163.7315 166.5941 178.3271 201.2654 203.5865 213.9564 228.4790 234.4227 242.4396 251.6912 268.7240 276.4770 284.3803 294.7131 303.6543 325.9621 341.4426 356.6696 367.9506 377.4813 420.6419 432.4029 436.9423 466.8082 483.6665 512.8542 518.2706 537.1805 557.2413 594.9124 609.5924 639.4507 649.0549 657.7282 679.3364 680.4501 697.0917 712.0683 752.6927 768.6874 769.4445 780.0214 822.8575 845.7816 847.5850 857.9745 867.7617 878.2327 887.1235 894.0624 907.0961 911.6321 939.0270 945.6506 978.1086 1002.0927 1015.2277 1027.0399 1034.7655 1056.9664 1066.6346 1084.0253 1098.2466 1111.1313 1112.8508 1114.0984 1115.5245 1119.5759 1127.9683 1150.4745 1153.2519 1155.8413 1159.2536 1159.9431 1180.9983 1190.8693 1209.6066 1219.9221 1254.5784 1271.4758 1278.3245 1301.3736 1328.3043 1333.8213 1352.8258 1362.0388 1363.0529 1384.1533 1390.8679 1400.8582 1403.0869 1417.2409 1418.4847 1436.5040 1440.9002 1454.0551 1458.7348 1458.8172 1460.0459 1465.5887 1469.0506 1472.4509 1477.5229 1478.7664 1482.1230 1484.8211 1487.0492 1488.7312 1571.1162 1605.3931 1623.0620 1628.7044 2946.3524 2972.0719 2973.7132 2977.1516 2985.0530 2994.5479 3006.5502 3009.0776 3070.1952 3077.3255 3079.2327 3080.8978 3084.2599 3088.3776 3104.0991 3106.8475 3120.4259 3121.1251 3126.1434 3145.0390 3152.8692 3165.6435 3192.8458 3555.8033
redmass: 2.3535 5.0906 5.0042 4.6195 4.6334 3.4650 3.1932 3.3347 3.1008 3.0065 3.7887 2.9510 1.3843 3.6950 1.2519 1.4465 2.2054 1.2499 2.6143 1.9400 2.3617 4.4866 1.6988 3.8469 2.4631 3.0742 3.4806 3.1041 4.7988 4.4147 5.8265 4.4376 5.1430 3.8390 4.3013 4.3543 4.3705 5.4948 3.6805 5.3754 4.3871 5.1185 5.7503 5.3322 6.2875 4.7278 6.6797 4.7846 5.9397 9.1717 4.2815 4.3087 6.0075 3.6820 5.9421 4.0609 3.0118 1.8233 4.4807 3.1821 4.3457 2.0567 1.6455 1.5344 2.1430 2.7607 4.3804 2.9908 5.3839 3.1379 3.3570 2.7899 6.1753 1.7251 1.4585 2.0691 2.2586 2.2283 1.2567 1.3298 1.2675 1.0385 2.1836 1.4403 2.6627 1.8057 1.5249 1.7514 2.5428 1.9565 1.4346 1.3363 1.5241 7.9264 1.5902 6.8631 1.3871 1.3861 2.0706 2.4726 1.9151 1.2615 1.2329 2.0830 3.5883 1.4365 4.2870 1.2279 1.5794 1.2402 1.0717 1.0688 1.1061 1.8138 2.4836 1.1455 1.0573 1.0526 1.0614 1.0547 1.0562 1.2469 7.3731 7.0157 10.1786 8.2971 1.0815 1.0312 1.0336 1.0298 1.0399 1.0359 1.0539 1.0821 1.1036 1.1052 1.0962 1.0987 1.1182 1.0990 1.0999 1.0999 1.1032 1.1028 1.1045 1.0914 1.0921 1.0925 1.0933 1.0651
irintensity: 13.1989 0.0581 0.6189 0.4489 2.1297 1.9103 1.8287 0.8882 3.8141 9.2666 0.6239 0.7579 0.5529 0.7131 1.0033 1.4588 4.2510 1.4243 1.2603 4.5655 6.0218 5.5393 14.6747 18.6297 48.2421 12.3402 7.8603 42.1749 4.3252 1.4153 11.6048 26.3563 2.7701 10.4331 0.7108 12.8039 12.2814 3.9292 3.1405 1.5905 13.0384 5.9120 7.2996 11.9437 4.6920 8.0252 5.7175 6.5799 6.7896 0.1497 0.6224 8.4360 8.3327 9.4817 7.2670 6.3046 9.3797 28.6297 28.4371 74.1957 9.4337 29.0821 17.9445 6.6459 115.2297 3.5806 63.9437 33.6251 166.8812 33.0374 39.0096 44.1627 174.6204 26.5579 4.4792 205.5573 78.6808 85.1884 10.6702 18.7787 4.5365 0.6651 146.6234 5.1095 37.0700 35.0439 5.4585 18.6619 26.2248 28.6817 10.2628 4.9120 37.9036 115.0119 37.2081 133.5464 4.5861 10.4269 30.0139 8.9813 8.4505 36.4703 33.4079 76.7678 67.3628 4.1806 5.7178 21.9690 27.0533 41.1808 22.8684 7.8190 8.1024 41.5220 217.0029 27.0696 1.7501 10.6832 7.2059 19.2393 29.3956 21.1430 79.1280 53.4585 16.3767 14.8342 18.6843 56.3540 104.0637 57.1033 18.5592 15.0114 144.7358 11.5552 26.2922 20.3177 34.2045 34.2107 35.3851 20.3000 17.2330 18.0885 24.5859 24.3845 16.5140 3.3241 1.0854 2.1302 0.2850 11.5378
temp: 298.150 k
press: 1.00000 atm
elementType: 8 8 8 8 8 8 8 6 6 6 6 6 6 6 6 6 6 6 6 6 6 6 6 6 6 6 6 6 1 1 1 1 1 1 1 1 1 1 1 1 1 1 1 1 1 1 1 1 1 1 1 1
symmnumber: 1
zpe: 1075729.3 jmol-1
zpe.correction: 0.409724 hartree
zpe.thermalcorrener: 0.437176 hartree
zpe.thermalcorrenthalpy: 0.438120 hartree
zpe.thermalcorrgfe: 0.351747 hartree
zpe.sumelectzpe: -1339.033054 hartree
zpe.sumelectthermal: -1339.005601 hartree
zpe.sumelectthermalent: -1339.004657 hartree
zpe.sumelectthermalfe: -1339.091031 hartree
dipole: 1.0498 -1.4253 1.1460
dipole: 2.1088
quadrupole: -146.5934 -151.4491 -164.7132
quadrupole: -7.6676 -6.9557 4.6111
quadrupole: 7.6585 2.8028 -10.4613 -7.6676 -6.9557 4.6111
hfenergy: -1339.4427774 hartree
pointgroup: C01 [X(C21H24O7)]
dipole: -0.3728324 0.6285896 0.392671 debye
polarizability: 303.4938129|-0.6522114|264.9506274|-18.3495447|-10.2359785|204.5476785 unknown
InChI: InChI=1S/C21H24O7/c1-11-19(12-6-17(23-3)20(25-5)18(7-12)24-4)13-8-15-16(27-10-26-15)9-14(13)28-21(11,2)22/h6-9,11,19,22H,10H2,1-5H3
charge 0 multiplicity 1
52 atoms
O  3.126127 -1.96422 -0.647471
O  2.340151 -4.149128 -0.811237
O  2.722455 3.484818 0.521565
O  4.691872 2.680791 -0.605169
O  -3.925661 -0.016218 2.365077
O  -2.796138 0.773343 -2.396845
O  -4.750274 0.873599 -0.276168
C  0.773454 -2.507559 -0.040974
C  0.602035 -1.144122 0.702702
C  2.242703 -2.979584 0.025905
C  1.725913 -0.163761 0.33665
C  -0.793046 -0.563706 0.446992
C  -0.202806 -3.580548 0.481662
C  2.911123 -0.613746 -0.306116
C  2.820557 -3.235007 1.427888
C  1.600189 1.221712 0.656457
C  3.965565 0.269914 -0.673803
C  -1.163305 -0.112411 -0.844372
C  -1.731956 -0.471208 1.497593
C  2.636223 2.080511 0.302383
C  3.793432 1.613751 -0.356376
C  -3.039679 0.023035 1.273433
C  -2.456447 0.391751 -1.077372
C  -3.425194 0.432684 -0.031998
C  4.00974 3.900948 -0.090257
C  -4.673528 1.22301 2.674013
C  -3.165856 2.198542 -2.560801
C  -5.540671 -0.070331 -1.106502
H  0.577294 -2.346361 -1.119469
H  0.664908 -1.353605 1.792392
H  -0.09098 -3.736337 1.571546
H  -1.244975 -3.2697 0.296184
H  -0.025709 -4.540992 -0.029199
H  3.875327 -3.552163 1.340742
H  2.794803 -2.322906 2.048168
H  2.254373 -4.032683 1.937201
H  0.697109 1.594029 1.147569
H  4.857006 -0.112523 -1.174106
H  3.298043 -4.379656 -0.924277
H  -0.453495 -0.125487 -1.677676
H  -1.477601 -0.793301 2.51311
H  3.805304 4.578494 -0.938503
H  4.645158 4.363196 0.6844
H  -5.308491 0.964467 3.535089
H  -5.286882 1.538266 1.814271
H  -3.969053 2.02949 2.955803
H  -4.025832 2.45923 -1.918638
H  -3.428431 2.31063 -3.623812
H  -2.301007 2.844485 -2.317108
H  -5.057091 -0.214418 -2.089245
H  -6.52866 0.399948 -1.227595
H  -5.642193 -1.039563 -0.584407
