program: Gaussian 09
title: 000146563
version: EM64L-G09RevD.01
frameworkgroup: C1[X(C12H13N5)]
method: RPBEPBE
basis: SDD
operation: Freq
keyword: #pfreq=noraman
keyword: PBEPBE/SDD
title: #p freq=noraman PBEPBE/SDD
converged: NO YES NO NO
title: Mulliken charges:
elementType: N N N N N C C C C C C C C C C C C H H H H H H H H H H H H H
charge: -0.237735 -0.039349 -0.001970 0.044898 -0.629443 0.382193 -0.109596 -0.001108 0.523615 -0.226362 -0.620760 0.116365 -0.665081 -0.819391 0.228029 -0.432740 -0.790419 0.231426 0.241606 0.252587 0.241769 0.242272 0.205612 0.242260 0.243904 0.327576 0.344209 0.227780 0.249990 0.227866
chargesum: 0.00000
title: Mulliken charges with hydrogens summed into heavy atoms:
elementType: N N N N N C C C C C C C C C C C C
charge: -0.237735 -0.039349 -0.001970 0.044898 0.042342 0.382193 -0.109596 -0.001108 0.523615 -0.226362 -0.389334 0.116365 0.070880 -0.129247 0.228029 -0.188837 -0.084783
polarizability: 2.84983539e+02 -3.81518887e+00 1.79575914e+02 1.03343402e-02 -2.71880733e-03 7.83796706e+01
1716.lowfreq: -84.0719 -7.2170 -6.5666 -0.0008 -0.0003 0.0004 4.4060 42.0890 59.1011
frequency: -84.0688 42.0885 59.0969 79.7701 96.9446 117.4214 129.9273 161.0752 184.1929 200.2725 232.3268 264.3808 280.1332 328.8788 334.1887 336.2682 394.1947 422.4077 438.6495 455.4751 481.4193 526.8397 536.9696 590.2918 621.7281 646.6955 650.9767 665.7777 688.1318 732.1348 798.1528 818.4955 838.9531 862.0044 904.1518 921.6019 979.5719 984.4366 991.9969 1019.8415 1043.2148 1050.0562 1051.1180 1115.0535 1119.1103 1178.2018 1221.4081 1230.4737 1251.5883 1277.3933 1290.0345 1334.5725 1381.0138 1387.2326 1401.2775 1406.5850 1413.3610 1429.4641 1451.9950 1457.3499 1463.2308 1465.7720 1466.5694 1476.1008 1483.3143 1493.3053 1528.9018 1553.9659 1582.0797 1608.9474 1640.1664 2970.4226 2979.9106 2985.0017 3045.0868 3057.2326 3067.5926 3085.4777 3110.3568 3112.6901 3115.0976 3125.0177 3578.0810 3725.8994
redmass: 1.0901 1.1585 2.5292 2.0974 2.2086 1.0944 2.3424 3.9872 3.0579 4.5417 2.7357 2.8943 3.5608 3.2868 5.1192 4.2661 4.6128 5.2639 4.8374 1.2130 4.3367 6.1423 4.3274 4.4015 5.1314 3.9080 4.9897 6.5412 9.5833 5.8534 6.3231 4.8502 6.8028 1.4713 1.3578 3.1884 2.5426 1.9369 2.2924 2.3805 1.5672 1.5606 2.5230 2.9925 1.3100 2.2219 3.5605 3.1066 2.6509 3.3797 8.6596 3.7695 3.4309 1.2789 1.3064 2.1971 3.7068 2.7538 1.0462 1.7628 1.8217 1.0470 1.2668 1.0406 1.1477 2.2701 5.4415 2.7012 3.5449 3.7302 2.7283 1.0368 1.0379 1.0359 1.1023 1.0972 1.0967 1.1007 1.0962 1.0976 1.0923 1.0910 1.0449 1.1049
irintensity: 34.8922 1.6902 0.7197 8.9333 17.1510 11.2574 51.3424 6.0576 12.1298 10.1659 0.4567 1.8016 24.4736 3.0542 0.7465 0.3445 25.4390 0.5920 8.5906 134.4632 0.7893 0.7068 2.9880 0.2300 19.0760 7.1905 4.6966 0.7944 5.7549 2.7430 2.2505 4.3076 1.8040 17.4858 10.8501 7.4509 21.5724 3.9928 26.3907 10.5802 1.6850 13.3200 3.2122 9.0890 0.4282 42.4904 36.1140 0.0480 70.1544 3.7667 0.4172 74.3579 59.8428 23.3135 18.4506 22.7370 14.8170 19.8983 12.2980 26.1106 55.0245 13.9956 5.2852 14.2153 20.6794 51.8470 54.2307 134.7186 0.1470 50.1903 601.4803 80.7900 28.4746 40.3885 26.9824 19.6223 15.8350 21.2045 8.0120 8.1107 32.8831 20.0417 145.4509 42.1845
temp: 298.150 k
press: 1.00000 atm
elementType: 7 7 7 7 7 6 6 6 6 6 6 6 6 6 6 6 6 1 1 1 1 1 1 1 1 1 1 1 1 1
symmnumber: 1
zpe: 616247.8 jmol-1
zpe.correction: 0.234716 hartree
zpe.thermalcorrener: 0.250031 hartree
zpe.thermalcorrenthalpy: 0.250975 hartree
zpe.thermalcorrgfe: 0.192085 hartree
zpe.sumelectzpe: -737.645466 hartree
zpe.sumelectthermal: -737.630152 hartree
zpe.sumelectthermalent: -737.629208 hartree
zpe.sumelectthermalfe: -737.688098 hartree
dipole: -5.1755 2.7556 -0.0003
dipole: 5.8633
quadrupole: -58.6363 -99.1602 -102.6295
quadrupole: -6.2981 0.0075 0.0016
quadrupole: 28.1724 -12.3515 -15.8208 -6.2981 0.0075 0.0016
hfenergy: -737.8801829 hartree
pointgroup: C01 [X(C12H13N5)]
dipole: -2.0405228 -1.0759461 0.0001287 debye
polarizability: 285.0125151|3.3912458|179.5469381|-0.0103452|-0.0026772|78.3796706 unknown
InChI: InChI=1S/C12H13N5/c1-6-4-8-10(16-12(13)17(8)3)11-9(6)15-7(2)5-14-11/h4-5H,13H2,1-3H3
charge 0 multiplicity 1
30 atoms
N  -2.87052 -0.369936 -0.00024
N  -1.799956 1.669894 0.000059
N  2.698764 -0.584017 -0.00006
N  1.252997 1.895737 0.000027
N  -4.212842 1.66532 -0.000114
C  -1.484511 -0.645453 -0.000097
C  -0.850113 0.631709 -0.00006
C  0.578763 0.68579 -0.000054
C  0.625203 -1.853582 -0.000065
C  1.308895 -0.578736 -0.00007
C  -0.777087 -1.872471 -0.000061
C  -2.987406 1.031889 -0.000069
C  -3.972206 -1.329967 -0.000342
C  1.433136 -3.134573 -0.000054
C  3.340463 0.60613 -0.000044
C  2.598215 1.839781 0.000034
C  4.85293 0.605794 -0.00024
H  -1.301139 -2.835493 -0.000003
H  -4.605395 -1.215392 -0.900813
H  -3.566464 -2.353117 -0.003695
H  -4.602113 -1.219805 0.902987
H  2.096961 -3.185299 0.88155
H  0.773753 -4.020145 0.000197
H  2.096593 -3.185552 -0.881927
H  3.128715 2.799967 0.000101
H  -5.093776 1.16303 0.000626
H  -4.207206 2.681161 -0.000091
H  5.255721 1.127446 0.88835
H  5.21963 -0.432441 0.002029
H  5.255396 1.12323 -0.891463
