program: Gaussian 09
title: 000010100
version: EM64L-G09RevD.01
frameworkgroup: C1[X(C22H29NO2)]
method: RPBEPBE
basis: SDD
operation: Freq
keyword: #p
keyword: freq=noraman
keyword: PBEPBE/SDD
title: #p freq=noraman PBEPBE/SDD
converged: YES YES NO NO
title: Mulliken charges:
elementType: O O N C C C C C C C C C C C C C C C C C C C C C C H H H H H H H H H H H H H H H H H H H H H H H H H H H H H
charge: -0.304263 -0.243003 -0.099513 0.243071 -0.099730 -0.702496 -0.399669 0.417082 -0.775349 0.530680 -0.338206 -0.365549 0.278781 -0.621995 -0.625330 -0.422899 -0.416398 -0.267216 -0.262256 -0.499633 -0.241151 -0.245969 -0.248776 -0.244815 -0.658835 0.252491 0.273874 0.212975 0.214009 0.221335 0.234609 0.264388 0.201463 0.236645 0.227200 0.185238 0.218868 0.229005 0.187607 0.230711 0.218984 0.257448 0.236087 0.225467 0.224945 0.249442 0.233737 0.229032 0.225963 0.224806 0.227916 0.225420 0.213221 0.230553
chargesum: 0.00000
title: Mulliken charges with hydrogens summed into heavy atoms:
elementType: O O N C C C C C C C C C C C C C C C C C C C C C C
charge: -0.304263 -0.243003 -0.099513 0.243071 0.152762 -0.215646 0.035675 0.417082 -0.074890 0.530680 -0.101561 -0.138349 0.278781 0.011115 0.011972 -0.165451 -0.180311 -0.041749 -0.037311 -0.016454 -0.012119 -0.020006 -0.023970 -0.016899 0.010358
polarizability: 2.85500671e+02 -2.21577755e+01 2.30963665e+02 -1.43523272e+01 -6.52563556e+00 2.13122722e+02
1716.lowfreq: -19.6654 -11.0277 -5.5955 0.0002 0.0005 0.0006 7.0121 22.6139 27.4804
frequency: -19.2055 22.3544 27.3231 40.6259 45.6010 49.3214 62.1212 66.7111 72.5310 94.3562 107.0640 110.6232 155.5870 165.2234 182.1789 204.6541 213.1392 213.8242 227.0890 230.4988 238.0998 245.3366 258.5236 288.0506 306.9248 323.9726 347.4565 391.8775 401.3541 406.3715 408.2475 415.5639 443.2685 458.0666 483.4060 529.2702 538.1185 567.5815 591.1957 617.4867 619.0114 638.9019 657.6258 702.6308 706.7562 710.9706 762.7213 770.9378 791.9632 798.4531 805.7985 822.1754 852.8790 857.3771 858.0542 888.7534 903.4090 921.4205 927.0753 934.1926 977.0248 978.2787 987.4396 990.9435 992.3926 994.0049 998.1488 1014.5128 1018.0736 1028.7017 1029.6243 1034.2713 1046.4315 1065.6473 1077.2533 1081.4439 1086.1953 1090.2829 1098.4380 1103.1880 1129.9408 1142.8660 1146.0411 1171.5870 1173.7972 1186.1100 1191.7028 1198.4810 1205.0439 1216.3973 1239.5151 1243.3007 1259.4576 1284.6842 1305.3307 1321.1412 1324.4606 1331.7931 1335.4257 1339.6834 1363.8137 1375.5509 1377.5748 1383.4265 1397.0555 1419.4193 1434.0355 1440.3806 1440.7774 1441.0827 1460.7171 1465.7561 1469.1418 1469.6683 1474.7641 1475.6506 1479.8855 1480.7939 1483.9183 1484.8936 1485.6073 1493.0992 1588.5206 1591.1016 1613.1796 1613.8298 1638.2618 2844.3049 2856.5775 2905.0007 2980.3289 2992.7695 2997.8199 3004.1155 3015.4345 3023.1597 3025.3056 3032.5904 3040.2539 3072.4820 3075.7938 3083.4244 3085.3542 3087.0633 3094.4344 3100.1743 3117.9830 3123.0395 3123.1669 3131.5200 3135.9166 3144.4519 3147.0655 3154.8438 3161.1773 3166.6816
redmass: 1.7569 3.8330 2.8405 3.9566 3.5817 3.5297 4.2119 4.0279 3.5847 4.3539 4.1768 3.8628 3.6983 3.0639 1.2364 1.5403 1.7031 3.0903 3.5100 1.3589 2.9327 1.3616 4.2494 6.0276 2.8046 4.3280 3.3931 1.8966 2.1403 2.7988 2.5927 2.6786 3.0838 2.8167 3.2618 4.3649 2.7411 4.6083 3.5652 6.3984 6.2229 4.4941 3.9082 4.0493 1.6333 1.7618 2.2048 2.2153 1.3715 3.6671 3.7429 3.8567 1.2770 1.2595 3.2190 2.2766 1.6426 1.4081 1.4757 1.8546 1.4866 1.3929 2.6728 4.8579 3.2907 1.3221 1.4940 1.9070 2.3197 2.3025 2.2490 1.5697 2.3312 2.0430 2.6542 1.6121 1.4137 1.4942 1.7637 2.1246 2.5362 1.7321 2.2439 1.0546 1.0555 2.3602 1.1386 1.1915 2.2901 2.6390 1.4969 1.1790 2.5379 1.4187 1.4435 1.3406 1.4107 1.3430 1.7383 1.3511 1.3010 1.8135 2.4111 5.9564 1.2141 1.1397 2.2510 1.1564 1.8879 1.1601 1.0487 1.0642 1.1094 1.0402 1.0578 1.0972 1.0533 1.0785 2.0914 1.5794 1.1911 1.1231 5.9674 5.8986 6.0451 6.0735 9.2427 1.0572 1.0573 1.0666 1.0357 1.0578 1.0394 1.0817 1.0719 1.0607 1.0723 1.0919 1.0985 1.0991 1.1004 1.1002 1.0994 1.0996 1.1003 1.1003 1.0846 1.0873 1.0845 1.0879 1.0920 1.0962 1.0922 1.0949 1.1015 1.1005
irintensity: 0.6580 0.0367 0.3086 0.7036 0.9539 0.1790 0.8190 0.4255 0.2257 2.3619 1.0277 0.6381 1.7250 0.6399 0.9712 0.3724 1.0098 0.3123 0.2465 0.2610 0.2111 1.1625 3.9595 3.4707 4.1428 4.5251 10.2218 1.1579 1.2110 0.3174 0.4077 2.9733 0.4376 2.9522 3.6384 8.9821 1.6505 13.0533 9.0539 0.1878 0.2121 7.1305 7.2296 3.0401 60.1235 80.6342 18.4018 41.0587 16.7042 8.4723 2.8829 10.8765 0.3984 0.1810 12.1171 14.4720 4.4345 5.9633 0.4219 4.5270 6.3787 2.1178 22.5211 0.8799 5.1102 0.7002 5.0549 63.3714 76.6227 8.5806 18.5675 6.7414 16.6117 2.9406 96.1821 0.7918 8.5923 11.5285 7.9552 26.3561 199.2175 2.9755 17.9518 0.0121 0.2755 0.2857 0.8181 2.2025 8.8444 0.2562 2.3785 0.1330 8.9695 10.7488 0.6163 2.7513 2.2416 17.9436 38.8705 12.5872 15.9103 19.0296 10.3227 1.2054 22.2049 5.3260 9.9171 2.3365 9.4723 26.1192 16.6809 9.8717 11.9618 10.8202 19.7739 7.0889 11.3786 17.6821 1.2641 9.2548 25.3784 18.7259 3.0556 1.6160 4.9804 8.1440 127.8321 66.8751 175.7566 77.8005 24.0372 25.3892 19.5304 2.7929 43.3641 16.5832 44.1308 28.5486 4.5266 34.1997 45.5387 59.2551 5.1356 1.1507 30.1456 29.8873 4.7021 0.3752 1.7256 3.9637 17.8141 35.1379 28.2997 38.4444 25.9861 13.4346
temp: 298.150 k
press: 1.00000 atm
elementType: 8 8 7 6 6 6 6 6 6 6 6 6 6 6 6 6 6 6 6 6 6 6 6 6 6 1 1 1 1 1 1 1 1 1 1 1 1 1 1 1 1 1 1 1 1 1 1 1 1 1 1 1 1 1
symmnumber: 1
zpe: 1199168.4 jmol-1
zpe.correction: 0.456739 hartree
zpe.thermalcorrener: 0.482015 hartree
zpe.thermalcorrenthalpy: 0.482959 hartree
zpe.thermalcorrgfe: 0.400456 hartree
zpe.sumelectzpe: -1059.048681 hartree
zpe.sumelectthermal: -1059.023405 hartree
zpe.sumelectthermalent: -1059.022461 hartree
zpe.sumelectthermalfe: -1059.104964 hartree
dipole: 0.3641 1.5301 1.4053
dipole: 2.1092
quadrupole: -139.2433 -156.0499 -141.1931
quadrupole: -3.3317 -2.3940 -1.1674
quadrupole: 6.2521 -10.5545 4.3023 -3.3317 -2.3940 -1.1674
hfenergy: -1059.5054197 hartree
pointgroup: C01 [X(C22H29N1O2)]
dipole: 0.0475648 -0.5950205 -0.5764661 debye
polarizability: 290.4323388|9.1089123|225.0727735|17.4571252|-8.3665877|214.0819468 unknown
InChI: InChI=1S/C22H29NO2/c1-5-21(24)25-22(18(2)17-23(3)4,20-14-10-7-11-15-20)16-19-12-8-6-9-13-19/h6-15,18H,5,16-17H2,1-4H3
charge 0 multiplicity 1
54 atoms
O  -0.024516 0.501141 -0.94302
O  0.245463 2.774513 -0.424166
N  0.611327 -3.549226 -1.182595
C  0.32748 -0.002325 0.44579
C  0.15152 -1.556304 0.284336
C  -0.694477 0.595742 1.477193
C  1.017146 -2.155492 -0.860661
C  1.779215 0.391082 0.777629
C  0.429624 -2.335906 1.589709
C  -2.166814 0.505654 1.091906
C  2.746257 0.528823 -0.252325
C  2.205323 0.564066 2.119577
C  -0.028058 1.865638 -1.23984
C  1.703334 -4.322893 -1.807182
C  -0.628358 -3.620813 -1.983485
C  -2.823053 1.620192 0.504544
C  -2.934545 -0.660537 1.352542
C  4.089359 0.838297 0.04634
C  3.55092 0.869577 2.422531
C  -0.4206 2.063041 -2.698678
C  4.501651 1.008893 1.387777
C  -4.193223 1.562316 0.164093
C  -4.304823 -0.723136 1.013544
C  -4.93978 0.387266 0.411271
C  -0.468638 3.544506 -3.110554
H  -0.911024 -1.694005 0.006952
H  -0.416708 1.650616 1.637493
H  -0.539518 0.061409 2.430987
H  0.957884 -1.499728 -1.761024
H  2.073531 -2.180089 -0.533933
H  1.442376 -2.120376 1.976601
H  0.370734 -3.413478 1.358206
H  -0.297577 -2.114218 2.391466
H  2.441792 0.40546 -1.296939
H  1.49028 0.471201 2.942986
H  2.017658 -3.926722 -2.807124
H  1.382273 -5.371479 -1.946733
H  2.588065 -4.321444 -1.146083
H  -0.51992 -3.158588 -2.99837
H  -1.454662 -3.10471 -1.465834
H  -0.921532 -4.677776 -2.117042
H  -2.257065 2.542856 0.330879
H  -2.46396 -1.521386 1.842508
H  4.813596 0.94894 -0.768735
H  3.852589 1.003383 3.467557
H  -1.400496 1.570837 -2.85027
H  0.29685 1.497337 -3.324767
H  5.544315 1.251197 1.621413
H  -4.679866 2.436702 -0.283358
H  -4.877616 -1.632738 1.22794
H  -6.003447 0.342101 0.151412
H  -1.204678 4.100436 -2.504692
H  -0.749941 3.637731 -4.174482
H  0.511135 4.029819 -2.96219
