program: Gaussian 09
title: 000146537
version: EM64L-G09RevD.01
frameworkgroup: C1[X(C9H8Cl2O)]
method: RPBEPBE
basis: SDD
operation: Freq
keyword: #p
keyword: freq=noraman
keyword: PBEPBE/SDD
title: #p freq=noraman PBEPBE/SDD
converged: YES YES NO NO
title: Mulliken charges:
elementType: Cl Cl O C C C C C C C C C H H H H H H H H
charge: -0.043880 -0.017364 -0.149259 -0.590604 0.650261 -0.400611 -0.423121 -0.341536 -0.215172 -0.228325 -0.231379 -0.000512 0.303145 0.318665 0.235517 0.235074 0.234819 0.233691 0.236599 0.193992
chargesum: 0.00000
title: Mulliken charges with hydrogens summed into heavy atoms:
elementType: Cl Cl O C C C C C C C C C
charge: -0.043880 -0.017364 -0.149259 -0.287459 0.650261 -0.081946 -0.187604 -0.106462 0.019647 0.005365 0.005220 0.193480
polarizability: 1.53268325e+02 1.65467493e+01 9.96004009e+01 2.17058121e+00 4.46925662e+00 1.01182995e+02
1716.lowfreq: -7.1399 -1.5860 -0.0025 -0.0017 0.0024 7.6186 26.7272 46.2004 75.0082
frequency: 26.3880 46.1784 75.0039 102.6255 135.8420 159.3018 217.0043 256.2328 282.9967 311.2867 326.3013 400.4426 477.4076 541.6661 585.2741 608.6894 622.2634 659.2492 698.4444 782.7871 818.9915 849.0286 927.9075 959.5144 978.3095 990.7686 1001.2483 1025.8509 1046.3064 1076.1623 1102.2067 1153.7178 1172.8016 1176.7231 1192.3222 1217.1945 1236.1231 1318.5842 1366.4556 1383.7048 1393.1873 1447.0724 1485.4646 1594.2831 1611.6744 1646.3990 2915.5390 3082.2951 3123.2114 3126.5363 3131.8026 3142.6168 3155.2082 3170.3361
redmass: 4.6123 9.6504 8.1283 10.4790 7.6297 6.3341 4.4864 3.5390 8.1431 4.7532 7.5596 2.7757 4.3283 3.9871 5.6404 6.3534 6.5749 4.6412 1.6336 1.9627 4.7778 1.2567 1.4368 1.7494 1.4060 5.9635 1.3347 2.2755 4.9557 2.2053 2.2281 1.0986 1.1909 1.0674 1.1133 1.4810 1.7515 1.4315 1.7413 1.2135 4.0108 2.1239 2.3224 5.9602 6.0457 8.2059 1.0873 1.0872 1.0881 1.0872 1.0867 1.0915 1.0963 1.1016
irintensity: 0.2502 0.0329 0.4051 5.4383 9.1199 5.6030 4.0797 3.4939 2.5244 16.2301 4.8847 0.4259 4.9295 46.8621 6.5010 56.4080 57.9791 4.1301 65.5061 24.2876 8.1466 0.1002 0.8255 7.3051 0.2622 1.7223 0.0211 1.4451 40.5107 6.5457 5.2853 8.6945 0.1464 0.1990 1.5672 11.1796 28.9958 8.7482 9.1728 0.2306 3.6827 12.9481 1.9979 0.7042 3.7493 154.0249 69.2609 3.7538 1.9066 5.0533 1.1166 10.6492 29.4363 17.2379
temp: 298.150 k
press: 1.00000 atm
elementType: 17 17 8 6 6 6 6 6 6 6 6 6 1 1 1 1 1 1 1 1
symmnumber: 1
zpe: 378827.0 jmol-1
zpe.correction: 0.144288 hartree
zpe.thermalcorrener: 0.156071 hartree
zpe.thermalcorrenthalpy: 0.157015 hartree
zpe.thermalcorrgfe: 0.104081 hartree
zpe.sumelectzpe: -1342.215058 hartree
zpe.sumelectthermal: -1342.203275 hartree
zpe.sumelectthermalent: -1342.202331 hartree
zpe.sumelectthermalfe: -1342.255265 hartree
dipole: -4.0751 -0.6048 -1.3084
dipole: 4.3226
quadrupole: -87.0957 -93.1747 -75.7140
quadrupole: 0.9551 -6.0745 0.5539
quadrupole: -1.7676 -7.8466 9.6141 0.9551 -6.0745 0.5539
hfenergy: -1342.3593461 hartree
pointgroup: C01 [X(C9H8Cl2O1)]
dipole: -1.6232118 -0.1000882 0.4972759 debye
dipolederiv: -0.5483986 0.0587037 0.0076226 0.274324 -0.6043001 -0.2420276 0.2406296 -0.2984644 -0.293719 -0.2812669 0.0122901 0.0284152 -0.0049882 -0.4579305 -0.2372194 -0.0026163 -0.2627654 -0.3168706 -0.905857 -0.0128816 0.1420986 -0.105491 -0.3410063 0.1032088 0.2682962 0.0968101 -0.4253756 0.8782886 -0.1648086 0.0110597 -0.3711651 0.5756239 0.2593743 -0.2095446 0.288627 0.3457592 -0.2551515 0.0616363 -0.0162768 -0.0492254 -0.071573 -0.0337058 -0.0803421 -0.0227199 -0.0631348 -0.1782297 0.1218814 0.0155006 0.2652179 0.4289247 0.3130989 0.0488015 0.3000446 0.3254009 -0.0058491 -0.0736872 0.0706476 0.0571782 -0.0845118 -0.1006176 -0.0539449 -0.0746785 0.0203214 0.0037497 0.0239709 -0.0882345 -0.0814332 -0.06253 -0.0287576 -0.0190413 -0.0602006 -0.0363854 -0.0154095 0.0549649 -0.1358906 0.0597945 -0.1140641 -0.0415391 -0.1576355 -0.0362824 -0.0040358 -0.1348504 -0.0335001 0.0770099 -0.057421 -0.0617661 -0.1153502 0.1001841 -0.1251802 0.0529999 0.1064552 -0.0506339 0.0084574 -0.0440936 -0.1040303 -0.0591021 -0.0002873 -0.051611 -0.0482057 1.1937666 -0.1087617 -0.2107248 -0.1376811 0.3925918 -0.2555034 -0.1472282 -0.3183156 0.4947823 0.0422746 0.0037658 0.0068331 0.036105 -0.0042731 -0.0173544 -0.0138765 0.0213376 -0.0583348 0.0764452 0.022296 -0.0161802 0.0214875 0.0107913 -0.0255557 -0.0310525 0.0199343 -0.0340337 0.0702848 0.0528647 -0.0688747 0.0416519 0.0756126 0.0918283 -0.042507 0.0917112 -0.0071739 0.0064221 -0.0343735 0.0991842 -0.0202391 0.1021877 0.0414543 0.1047175 0.0494035 0.0449928 -0.018496 -0.0262312 0.0907089 -0.0326653 0.1248311 0.0666414 0.1033734 0.0669179 0.0145594 0.0597455 0.0365212 -0.0367575 0.0493336 0.0850476 0.1061804 -0.0524045 0.1108996 -0.0228578 -0.1029924 0.0535976 -0.0201788 0.0594408 0.1273986 0.0329927 -0.0188694 0.0334893 0.1059399 0.0090687 0.0023851 0.0355804 0.0398696 -0.0170241 0.1419538 -0.0366521 0.1710427 -0.0946288 unknown
polarizability: 154.2821596|-12.1017594|95.740489|-8.99432|0.449652|104.0290723 unknown
InChI: InChI=1S/C9H8Cl2O/c10-8(6-12)9(11)7-4-2-1-3-5-7/h1-6,8-9H
charge 0 multiplicity 1
20 atoms
Cl 1.27743 -2.01021 -0.965882
Cl 1.530734 1.743289 1.502417
O  4.154682 0.351575 -0.465037
C  0.730846 -0.631252 0.306839
C  -0.709158 -0.266395 0.083607
C  1.774576 0.463784 0.096999
C  -1.678125 -0.672137 1.035533
C  -1.124899 0.467937 -1.058062
C  -3.038847 -0.338398 0.860827
C  -2.483628 0.79805 -1.234747
C  -3.444491 0.398313 -0.274881
C  3.218187 -0.012916 0.275266
H  0.881967 -1.129929 1.27719
H  1.654378 1.025927 -0.839639
H  -1.364954 -1.244046 1.917346
H  -0.393929 0.765661 -1.818386
H  -3.778024 -0.651988 1.605588
H  -2.797146 1.363163 -2.119061
H  -4.499822 0.657256 -0.4138
H  3.374721 -0.686484 1.152984
