program: Gaussian 09
title: 000146594
version: EM64L-G09RevD.01
frameworkgroup: C1[X(C22H25NO4)]
method: RPBEPBE
basis: SDD
operation: Freq
keyword: #p
keyword: freq=noraman
keyword: PBEPBE/SDD
title: #p freq=noraman PBEPBE/SDD
converged: YES YES NO NO
title: Mulliken charges:
elementType: O O O O N C C C C C C C C C C C C C C C C C C C C C C H H H H H H H H H H H H H H H H H H H H H H H H H
charge: -0.263581 -0.267867 -0.265670 -0.266535 -0.140715 -0.141648 -0.042845 -0.358378 -0.337885 -0.395098 -0.455283 -0.453832 0.359005 -0.745618 0.186303 0.480870 -0.530200 -0.532161 0.158266 -0.421493 -0.388549 0.211053 -0.363476 -0.380349 0.316548 -0.207193 -0.537905 0.242934 0.232694 0.224431 0.252521 0.173068 0.200561 0.222998 0.230040 0.206840 0.215592 0.226247 0.200756 0.246620 0.242000 0.265387 0.272569 0.234545 0.253351 0.248355 0.239359 0.238936 0.228114 0.244631 0.219811 0.221872
chargesum: 0.00000
title: Mulliken charges with hydrogens summed into heavy atoms:
elementType: O O O O N C C C C C C C C C C C C C C C C C C C C C C
charge: -0.263581 -0.267867 -0.265670 -0.266535 -0.140715 0.101286 0.189849 -0.133947 0.087705 0.028461 -0.018402 -0.011993 0.359005 -0.056242 0.186303 0.480870 -0.264813 -0.259592 0.158266 -0.186948 -0.135199 0.211053 -0.115120 -0.140990 0.316548 0.259857 0.148409
polarizability: 3.08044021e+02 -5.31585825e+00 2.63562289e+02 -1.46107421e+01 -1.41908729e+00 2.07769323e+02
1716.lowfreq: -3.5855 0.0003 0.0006 0.0007 1.7082 5.5122 26.0467 32.1721 33.8794
frequency: 26.0178 32.0947 33.7888 41.1286 46.8438 65.1147 82.6687 95.9219 103.9701 112.2531 117.5890 153.0094 167.0147 177.6218 183.8356 191.2024 227.0026 230.6981 242.1703 251.0631 264.3883 279.0345 292.5338 324.1410 351.7868 367.2095 383.0172 414.1832 440.5893 449.8394 462.8555 493.9609 536.8948 545.5072 581.6561 595.0098 617.9229 631.3405 642.9829 674.1496 676.6669 699.7265 710.7119 728.3384 744.4857 755.7049 774.5673 790.6291 802.7386 818.2466 827.5862 836.2084 840.9921 852.5671 857.4983 861.0977 880.1081 889.5330 903.6721 906.4666 946.2603 959.7025 964.6875 968.0040 973.1070 982.2272 989.0417 1004.1786 1007.7706 1058.7375 1065.7393 1074.3740 1094.4251 1099.0835 1110.1784 1112.0534 1121.5754 1128.2826 1133.1692 1147.7800 1155.4108 1161.9386 1170.1028 1181.0173 1190.4017 1199.7329 1202.0751 1207.6600 1227.4148 1229.4270 1240.8011 1247.4371 1254.4696 1264.1888 1285.8410 1296.4504 1298.5907 1307.8430 1321.9975 1326.6390 1340.2943 1349.2279 1359.5176 1371.4450 1381.5686 1391.4665 1413.6741 1415.8515 1429.6192 1435.8386 1462.9272 1465.4240 1465.4775 1466.7889 1472.7623 1479.0016 1482.5091 1483.9321 1487.0045 1498.8339 1500.9646 1582.2369 1621.3692 1622.5999 1630.6540 2814.2774 2850.2629 2867.5427 2957.7572 2972.5979 2987.3781 2987.6779 3011.5854 3012.5331 3024.1242 3033.2190 3044.7621 3068.1006 3081.6503 3085.4239 3094.5401 3094.6135 3112.6561 3112.8043 3123.8531 3131.6226 3159.1631 3159.6332 3164.2360 3191.4065
redmass: 4.9340 3.2651 2.6919 4.9987 3.2655 2.9005 2.7438 3.9306 2.8705 2.9614 4.3472 3.6459 3.4121 1.4662 2.5696 3.9225 2.2978 1.5405 5.4775 3.3334 4.4581 4.7968 3.2477 3.3197 5.8796 4.8264 5.6999 2.9671 3.5936 4.4430 5.3569 3.8218 4.5613 3.1954 5.2854 4.1623 2.6039 6.5510 9.3054 4.9109 6.9036 4.3480 4.6571 3.6490 3.9952 4.9064 3.2955 3.0021 1.9021 1.4389 2.1716 2.6713 4.2416 1.6852 2.0069 2.0243 1.5855 3.7981 2.9470 2.6160 1.4757 2.0230 1.3519 1.4464 4.8794 2.0295 8.2862 2.6295 3.2528 2.4373 2.1957 1.5104 2.3176 1.5478 1.4059 1.2619 2.0943 1.7956 1.4847 2.1801 1.4194 2.5991 1.8801 1.3506 1.3427 1.2558 2.2023 1.4024 1.9215 2.5206 1.5783 1.3711 1.4754 2.9147 1.2529 1.3454 1.3639 1.2993 1.5408 1.5025 1.4807 1.5986 1.2816 1.4566 4.0640 1.2446 5.1634 3.5754 5.1160 1.1734 1.0552 1.0505 1.0841 2.2259 1.0789 1.0800 1.0701 1.4136 1.0749 2.3697 1.1003 7.0962 6.7806 9.0926 8.1750 1.0799 1.0715 1.0717 1.0331 1.0831 1.0573 1.0422 1.0736 1.0693 1.0650 1.0868 1.1039 1.1037 1.0993 1.0939 1.1006 1.0999 1.1073 1.0895 1.0990 1.0885 1.0942 1.0928 1.0949 1.0933
irintensity: 0.0537 0.9365 0.7104 0.1192 0.8861 1.1653 2.4717 0.5965 8.9840 5.3300 1.3879 1.5299 0.7448 1.4236 2.9159 2.9724 1.2202 1.0394 0.8902 3.2751 0.6274 0.2626 1.3512 5.5431 1.7903 0.5394 2.8081 0.1714 5.8097 1.5452 1.1055 3.9714 18.7836 17.1133 9.9502 0.4837 1.7742 0.4038 2.0901 4.9975 0.1945 2.9824 6.1174 0.8777 12.0647 4.2398 3.9905 15.4397 1.1613 15.5086 34.0305 7.2544 27.8504 11.1596 26.1911 32.6498 35.4785 19.1345 22.1537 43.7641 6.8809 3.2391 0.1867 0.2752 165.0080 28.6526 37.1431 12.1494 45.8969 42.8854 10.1195 6.8206 1.3856 4.0510 7.0193 0.2979 20.0016 201.0429 56.4750 182.9297 5.2767 7.9986 80.4646 55.3269 3.3487 2.4949 9.5809 3.9785 96.0136 92.0089 10.9815 9.4875 17.3867 47.6108 8.6825 6.9169 1.4603 18.9267 65.8039 13.2535 15.7142 39.0004 0.7774 37.6098 11.7931 29.8445 67.1703 1.9986 16.0557 13.4563 2.0042 13.9756 4.0638 195.2407 62.5877 16.5246 3.1173 46.7103 3.6842 124.6658 0.9746 18.5154 34.7029 23.6578 20.1048 60.0147 69.9410 109.2628 65.9368 16.7065 103.7846 88.4920 46.0389 6.1462 65.6590 33.7189 47.8504 9.3369 25.2897 24.4241 35.5344 45.4836 29.3150 17.7289 31.4640 6.5995 13.0746 2.5817 7.0812 0.2307
temp: 298.150 k
press: 1.00000 atm
elementType: 8 8 8 8 7 6 6 6 6 6 6 6 6 6 6 6 6 6 6 6 6 6 6 6 6 6 6 1 1 1 1 1 1 1 1 1 1 1 1 1 1 1 1 1 1 1 1 1 1 1 1 1
symmnumber: 1
zpe: 1115827.5 jmol-1
zpe.correction: 0.424996 hartree
zpe.thermalcorrener: 0.449635 hartree
zpe.thermalcorrenthalpy: 0.450579 hartree
zpe.thermalcorrgfe: 0.369064 hartree
zpe.sumelectzpe: -1206.941456 hartree
zpe.sumelectthermal: -1206.916817 hartree
zpe.sumelectthermalent: -1206.915873 hartree
zpe.sumelectthermalfe: -1206.997388 hartree
dipole: -1.7234 0.6945 -1.0061
dipole: 2.1130
quadrupole: -148.2437 -157.4904 -149.7788
quadrupole: 4.8076 5.0697 -8.2224
quadrupole: 3.5940 -5.6528 2.0588 4.8076 5.0697 -8.2224
hfenergy: -1207.3664518 hartree
pointgroup: C01 [X(C22H25N1O4)]
dipole: -0.6553413 -0.2940427 0.4185169 debye
polarizability: 307.7900841|8.2049328|264.1354731|12.688426|-2.9436728|207.4500756 unknown
InChI: InChI=1S/C22H25NO4/c1-14-21(15-5-7-16(24-2)8-6-15)17-11-19-20(26-13-25-19)12-18(17)27-22(14)23-9-3-4-10-23/h5-8,11-12,14,21-22H,3-4,9-10,13H2,1-2H3
charge 0 multiplicity 1
52 atoms
O  0.516401 2.100328 0.373767
O  4.77625 -1.471136 -0.206203
O  5.088829 0.498028 1.124828
O  -3.305148 -4.566502 0.738837
N  -1.659239 2.920358 0.086436
C  -0.866252 1.059574 -1.415875
C  -0.871009 1.700997 -0.011032
C  -0.034653 -0.268394 -1.347714
C  -1.667034 3.556368 1.431988
C  -3.088318 2.790997 -0.318476
C  -2.730376 4.662264 1.272015
C  -3.785788 4.040744 0.301048
C  1.301628 -0.023972 -0.648909
C  -0.330038 2.028621 -2.490866
C  1.507803 1.125265 0.162122
C  -0.84976 -1.422232 -0.740048
C  2.373563 -0.949051 -0.826129
C  2.756081 1.398474 0.793414
C  3.59085 -0.678402 -0.209064
C  -1.818284 -2.084801 -1.543626
C  -0.705798 -1.844287 0.601639
C  3.777578 0.478592 0.580805
C  -2.617534 -3.120049 -1.029228
C  -1.499346 -2.884535 1.140044
C  -2.461745 -3.523126 0.321519
C  5.8021 -0.598344 0.414691
C  -3.172977 -5.02681 2.122602
H  -1.909255 0.784619 -1.662142
H  -1.188303 0.933425 0.74595
H  0.181735 -0.54522 -2.400153
H  -0.664688 3.936888 1.679739
H  -1.969969 2.828229 2.228037
H  -3.547698 1.855214 0.08711
H  -3.181912 2.760455 -1.418343
H  -2.269374 5.554538 0.814783
H  -3.167082 4.959832 2.241116
H  -4.703406 3.741853 0.837476
H  -4.079051 4.764617 -0.477968
H  -0.458814 1.595961 -3.500196
H  -0.863371 2.993303 -2.443839
H  0.743266 2.238356 -2.340587
H  2.230496 -1.848254 -1.432751
H  2.878891 2.292801 1.407037
H  -1.941891 -1.78815 -2.593375
H  0.051321 -1.370053 1.236261
H  -3.358577 -3.634904 -1.64843
H  -1.353948 -3.185594 2.181921
H  6.376842 -1.183658 1.147716
H  6.433669 -0.15548 -0.380307
H  -3.914152 -5.83238 2.230017
H  -3.397899 -4.214508 2.841362
H  -2.15831 -5.424554 2.320376
