program: Gaussian 09
title: 000146542
version: EM64L-G09RevD.01
frameworkgroup: C1[X(C19H13F)]
method: RPBEPBE
basis: SDD
operation: Freq
keyword: #pfreq=noraman
keyword: PBEPBE/SDD
title: #p freq=noraman PBEPBE/SDD
converged: YES YES NO NO
title: Mulliken charges:
elementType: F C C C C C C C C C C C C C C C C C C C H H H H H H H H H H H H H
charge: -0.206770 0.255138 0.459436 0.200113 0.404709 0.428655 -0.629523 -0.707400 0.446344 -0.493267 -0.468236 -0.636400 -0.432517 -0.335820 0.455494 -0.594765 -0.364470 -0.416379 0.335185 -0.814114 0.228768 0.247281 0.242048 0.238090 0.244981 0.241037 0.229376 0.266347 0.232152 0.255663 0.226952 0.231038 0.230855
chargesum: 0.00000
title: Mulliken charges with hydrogens summed into heavy atoms:
elementType: F C C C C C C C C C C C C C C C C C C C
charge: -0.206770 0.255138 0.459436 0.200113 0.404709 0.428655 -0.400755 -0.460119 0.446344 -0.251219 -0.230146 -0.391419 -0.191480 -0.106444 0.455494 -0.328418 -0.132318 -0.160716 0.335185 -0.125268
polarizability: 4.17082112e+02 1.81182142e+00 2.19726793e+02 -9.20653313e-03 -1.74864065e-02 8.19563871e+01
1716.lowfreq: -0.0007 0.0007 0.0008 5.8609 11.4532 16.4314 53.0620 65.0882 98.2643
frequency: 52.9987 65.0825 98.2643 117.5736 121.1456 151.1974 217.2953 239.1818 246.2890 278.8684 320.5945 333.0559 347.9244 394.6369 416.9860 429.8857 446.5085 473.9629 474.1372 515.7208 533.1924 534.6425 575.7843 594.4037 612.2461 640.5779 672.9004 701.7624 720.5443 752.5533 780.2035 784.1478 805.7432 817.2845 825.8440 830.6009 836.6567 873.5779 887.6100 916.7341 928.3588 937.1617 942.6580 950.3600 974.9318 980.3922 986.6680 1007.5131 1048.4341 1100.4918 1141.9484 1151.2977 1159.6111 1185.8328 1193.0553 1226.8650 1238.9451 1253.6870 1277.2356 1291.9150 1299.7166 1317.4276 1374.9756 1387.1467 1395.5225 1412.6362 1420.4076 1427.0755 1445.1983 1461.9570 1467.4556 1473.8182 1494.1878 1505.0468 1558.0272 1569.8786 1605.7166 1621.9837 1631.5977 1644.0840 2972.8088 3049.2584 3084.9575 3115.3438 3115.6986 3117.5333 3121.4639 3133.7222 3140.5726 3146.5254 3155.3766 3160.6922 3179.4729
redmass: 5.2270 4.0815 1.4122 2.2226 5.4947 4.6469 3.6827 4.4510 5.3770 8.6792 3.7875 4.4132 4.5787 4.4432 3.4320 2.9650 5.5269 4.8378 2.5183 6.9441 5.9148 2.9159 3.7827 6.4194 3.2942 6.5457 6.8685 3.1424 6.1338 6.2821 2.5280 1.6036 1.3725 4.4551 1.4693 1.8208 4.7110 1.5002 1.6738 1.5502 3.4255 2.1035 3.4759 1.3629 1.3583 3.9995 1.4366 1.6409 1.5663 1.9846 1.4788 1.6953 1.3007 1.7357 1.3519 2.1322 2.0055 1.9892 1.7259 2.1543 2.3824 1.8474 2.5548 5.2340 1.2510 5.1797 5.4314 2.3289 5.9008 3.4309 1.0460 1.2644 2.8758 3.7607 5.2234 7.6487 6.0936 6.6095 7.1118 6.7189 1.0374 1.0973 1.0987 1.0882 1.0901 1.0904 1.0865 1.0904 1.0978 1.0985 1.0871 1.0926 1.0967
irintensity: 0.0946 0.0306 1.6606 0.9092 0.1453 0.1301 0.3707 1.1612 0.2801 0.6318 4.6379 1.5143 0.4983 1.4535 2.7730 6.6110 6.8043 0.6572 13.8069 4.7028 8.3451 4.7328 0.3624 3.9433 0.5745 2.1052 1.4485 14.8818 1.2942 1.6431 0.6213 19.4874 9.2575 4.7540 7.0531 31.3282 17.5152 0.0022 20.6915 105.5831 11.4029 0.0412 27.9850 0.8279 5.0744 2.1418 1.5228 10.5229 13.0821 5.9715 21.2828 30.5912 3.0723 1.3915 12.3750 6.1010 31.6567 29.5989 0.0780 15.0091 0.3379 0.2980 1.4684 8.1622 8.4382 1.7074 2.7748 7.8764 2.6948 40.7019 13.4695 9.0469 38.7952 44.1587 4.1743 12.6437 6.8533 85.3661 1.2671 15.3369 49.1492 20.6793 16.1302 4.8235 16.0630 9.9177 3.2820 8.0099 36.7725 29.9561 8.2168 4.1053 6.3267
temp: 298.150 k
press: 1.00000 atm
elementType: 9 6 6 6 6 6 6 6 6 6 6 6 6 6 6 6 6 6 6 6 1 1 1 1 1 1 1 1 1 1 1 1 1
symmnumber: 1
zpe: 672438.7 jmol-1
zpe.correction: 0.256118 hartree
zpe.thermalcorrener: 0.271164 hartree
zpe.thermalcorrenthalpy: 0.272109 hartree
zpe.thermalcorrgfe: 0.214149 hartree
zpe.sumelectzpe: -830.367610 hartree
zpe.sumelectthermal: -830.352564 hartree
zpe.sumelectthermalent: -830.351620 hartree
zpe.sumelectthermalfe: -830.409579 hartree
dipole: -3.2182 0.3474 0.0000
dipole: 3.2369
quadrupole: -114.1941 -97.9228 -122.5746
quadrupole: 6.4286 0.0014 -0.0031
quadrupole: -2.6303 13.6410 -11.0108 6.4286 0.0014 -0.0031
hfenergy: -830.6237284 hartree
pointgroup: C01 [X(C19H13F1)]
dipole: -1.267387 -0.1242315 -0.0066214 debye
polarizability: 417.0225046|-3.7577394|219.7589682|1.2861892|1.7460498|81.9838194 unknown
InChI: InChI=1S/C19H13F/c1-12-2-3-13-9-14-4-5-15-10-17(20)6-7-18(15)19(14)11-16(13)8-12/h2-11H,1H3
charge 0 multiplicity 1
33 atoms
F  5.883123 1.250398 0.041049
C  0.338108 -0.106429 0.000595
C  -0.018635 -1.519214 -0.018682
C  1.762635 0.265094 0.01113
C  -2.076758 0.468423 -0.001681
C  -2.423499 -0.942921 -0.021017
C  -0.70491 0.84417 0.008456
C  -1.377983 -1.901146 -0.02903
C  2.764036 -0.773686 0.002128
C  1.029269 -2.520701 -0.027137
C  2.360905 -2.167069 -0.017245
C  -3.134266 1.444051 0.007012
C  -3.814533 -1.308755 -0.031098
C  2.20398 1.622023 0.030195
C  -4.479838 1.071262 -0.002644
C  4.149296 -0.431513 0.012232
C  -4.80737 -0.334855 -0.022173
C  3.565801 1.959694 0.040211
C  4.513604 0.912354 0.030847
C  -5.596324 2.098366 0.006989
H  -0.476174 1.91529 0.023102
H  -1.630338 -2.969114 -0.043762
H  0.735757 -3.576994 -0.041861
H  3.142984 -2.934832 -0.02382
H  -2.864648 2.507833 0.021985
H  -4.081749 -2.372294 -0.045896
H  1.473604 2.435679 0.037435
H  4.91719 -1.211213 0.005521
H  -5.864107 -0.629329 -0.029915
H  3.90183 3.000184 0.054959
H  -5.201871 3.128452 0.026951
H  -6.239244 1.998849 -0.88838
H  -6.251176 1.968844 0.889744
